program: Gaussian 09
title: 000296426
version: EM64L-G09RevD.01
frameworkgroup: C1[X(C10H14FN3O3)]
method: RPBEPBE
basis: SDD
operation: Freq
keyword: #p
keyword: freq=noraman
keyword: PBEPBE/SDD
title: #p freq=noraman PBEPBE/SDD
converged: YES YES NO NO
title: Mulliken charges:
elementType: F O O O N N N C C C C C C C C C C H H H H H H H H H H H H H H
charge: -0.161948 -0.289387 -0.280131 -0.217839 -0.107048 -0.142640 -0.406116 -0.523199 -0.349609 -0.414843 0.267844 -0.656013 -0.643273 0.237630 -0.176018 0.188217 0.111276 0.270779 0.270468 0.210295 0.259113 0.227579 0.290658 0.251664 0.209299 0.222048 0.218390 0.218620 0.229733 0.315425 0.369026
chargesum: 0.00000
title: Mulliken charges with hydrogens summed into heavy atoms:
elementType: F O O O N N N C C C C C C C C C C
charge: -0.161948 -0.289387 -0.280131 -0.217839 -0.107048 -0.142640 -0.037089 0.018049 0.119799 0.103393 0.267844 0.026999 0.023470 0.237630 0.139407 0.188217 0.111276
polarizability: 1.88281466e+02 -1.40997129e+01 1.32365951e+02 1.12024959e+01 9.09951041e+00 1.06415249e+02
1716.lowfreq: -9.8725 0.0005 0.0010 0.0012 0.9013 7.0042 21.4667 34.4192 61.7944
frequency: 21.4562 34.2780 61.7935 66.3550 75.9092 87.1807 116.3832 138.4843 172.9240 196.3621 209.9072 231.5200 252.1775 287.5088 310.2522 341.3619 358.7304 374.2153 394.0355 418.1424 430.0501 443.3651 484.7405 505.6353 580.5457 627.6316 639.9957 684.7756 688.6603 709.7207 747.7153 767.2991 774.1178 790.4623 800.0796 847.0978 876.0667 904.5748 942.6449 973.7886 1027.4685 1074.2602 1078.6410 1093.9734 1099.3308 1118.4092 1156.0213 1202.1364 1205.5447 1216.1588 1274.3853 1300.4876 1306.8522 1331.8986 1350.2767 1354.6246 1364.4616 1367.6598 1386.5617 1391.2612 1409.9779 1426.1075 1455.7999 1458.4156 1467.8764 1469.6547 1479.1099 1483.8492 1518.5870 1586.9658 1624.7734 1640.1231 1666.4407 2985.4226 2988.5891 3006.2889 3012.1637 3046.1357 3058.2376 3072.9166 3087.2202 3088.8736 3089.3946 3105.2280 3131.8913 3189.6762 3525.1770
redmass: 5.7762 4.6873 4.5715 2.9235 6.8840 3.0999 7.2184 3.8724 7.8915 1.7537 1.1038 1.9030 4.3586 11.2938 2.8153 3.0752 8.4339 9.1681 3.5985 3.5048 2.8370 4.3738 3.0834 7.3266 3.7486 4.9482 4.9952 2.3216 4.0418 8.2606 6.3638 2.6284 2.0568 1.4042 1.3115 2.9435 1.5759 2.5695 2.1315 2.1616 2.7337 2.1587 1.8681 2.3312 2.1620 4.4015 2.2200 2.6672 4.4588 1.7945 1.3870 1.2673 2.9600 1.5669 1.2748 1.5691 1.4271 1.5276 1.2181 1.2209 4.4207 3.1876 1.0834 1.1133 1.0479 1.0435 1.0510 1.0562 1.1048 5.5198 5.4662 11.3707 6.5478 1.0357 1.0359 1.0620 1.0623 1.0643 1.1021 1.1002 1.1002 1.0999 1.1008 1.1023 1.0995 1.0949 1.0771
irintensity: 1.5411 0.5939 3.5987 2.8724 3.0793 0.7286 1.8275 2.2525 6.3401 0.4003 0.8500 1.2534 0.4834 1.2418 0.7863 11.0719 3.5046 16.8377 7.7477 9.7039 0.8694 17.8024 9.4961 15.1856 11.9140 5.8289 6.9715 7.1508 14.6311 3.1305 6.2765 49.4898 73.8464 4.0535 24.0780 17.0601 26.4872 1.3636 7.3259 0.4877 5.4779 10.6720 7.3640 26.5507 31.3446 41.3325 72.5217 38.9995 13.6328 110.1432 30.6514 16.7039 88.5850 25.8913 8.4715 32.8455 8.2732 18.3553 13.5676 23.7318 18.6513 77.6394 31.2236 36.9005 2.6993 16.7172 7.8313 13.9891 4.2325 266.4547 346.1163 143.5551 587.6708 21.0706 21.2143 19.5601 43.9674 14.2111 9.4479 6.1978 35.6675 56.0053 5.6474 26.8371 1.7560 13.7210 65.6687
temp: 298.150 k
press: 1.00000 atm
elementType: 9 8 8 8 7 7 7 6 6 6 6 6 6 6 6 6 6 1 1 1 1 1 1 1 1 1 1 1 1 1 1
symmnumber: 1
zpe: 634877.6 jmol-1
zpe.correction: 0.241812 hartree
zpe.thermalcorrener: 0.259040 hartree
zpe.thermalcorrenthalpy: 0.259984 hartree
zpe.thermalcorrgfe: 0.195212 hartree
zpe.sumelectzpe: -877.968040 hartree
zpe.sumelectthermal: -877.950812 hartree
zpe.sumelectthermalent: -877.949868 hartree
zpe.sumelectthermalfe: -878.014639 hartree
dipole: -6.5020 2.1364 -0.8480
dipole: 6.8963
quadrupole: -111.6863 -108.9659 -95.9720
quadrupole: 2.7858 -8.2721 -2.9616
quadrupole: -6.1449 -3.4245 9.5694 2.7858 -8.2721 -2.9616
hfenergy: -878.209852 hartree
pointgroup: C01[X(C10H14F1N3O3)]
dipole: 2.4226442 -0.6870153 1.0101229 debye
polarizability: 180.6246555|-23.0995813|113.5301547|19.5414223|7.0456534|132.907856 unknown
InChI: InChI=1S/C10H14FN3O3/c1-3-13(4-2)8(15)6-14-5-7(11)9(16)12-10(14)17/h5,12H,3-4,6H2,1-2H3
charge 0 multiplicity 1
31 atoms
F  -3.370083 -0.013989 -2.098802
O  1.396902 -1.322879 -1.806297
O  -0.145481 0.49211 2.345399
O  -3.965808 1.87082 0.002389
N  2.770154 -0.457757 -0.12906
N  -0.65942 -0.600197 0.321064
N  -2.051487 1.125741 1.136132
C  0.533946 -1.472288 0.449327
C  3.809814 -0.122644 -1.140213
C  3.050433 -0.080259 1.282512
C  1.618991 -1.068396 -0.573309
C  3.623291 1.292572 -1.725215
C  3.804932 -1.180683 2.059509
C  -0.900273 0.352677 1.339775
C  -1.470013 -0.691189 -0.812307
C  -2.574935 0.104625 -0.961053
C  -2.971302 1.10116 0.037597
H  0.237468 -2.505138 0.199432
H  0.853622 -1.430698 1.499083
H  4.796811 -0.219028 -0.65128
H  3.743789 -0.870029 -1.948484
H  3.661964 0.840639 1.253591
H  2.111031 0.187922 1.795976
H  2.659024 1.361643 -2.256086
H  3.647915 2.065985 -0.935986
H  4.430927 1.514841 -2.446001
H  3.196916 -2.099479 2.144937
H  4.754498 -1.447208 1.56151
H  4.038447 -0.830392 3.0811
H  -1.152482 -1.40123 -1.579822
H  -2.255491 1.812347 1.869878
