program: Gaussian 09
title: 000022701
version: EM64L-G09RevD.01
frameworkgroup: C1[X(C22H21N2S)]
method: RPBEPBE
basis: SDD
operation: Freq
keyword: #p
keyword: freq=noraman
keyword: PBEPBE/SDD
title: #p freq=noraman PBEPBE/SDD
converged: YES YES NO NO
title: Mulliken charges:
elementType: S N N C C C C C C C C C C C C C C C C C C C C C C H H H H H H H H H H H H H H H H H H H H H
charge: 0.314579 -0.208174 -0.133864 0.527828 0.234750 -0.452654 0.442533 -0.016863 -0.312221 -0.451428 -0.325870 -0.670918 -0.422210 -0.240021 -0.260691 -0.227830 -0.281041 0.539113 0.407225 -0.386470 -0.405025 -0.337406 -0.349091 -0.640443 -0.638750 0.263250 0.263756 0.248125 0.284493 0.259862 0.262720 0.258732 0.244803 0.247159 0.253294 0.233258 0.225922 0.241151 0.255796 0.259229 0.239874 0.252676 0.253233 0.238696 0.254484 0.254430
chargesum: 1.00000
title: Mulliken charges with hydrogens summed into heavy atoms:
elementType: S N N C C C C C C C C C C C C C C C C C C C C C C
charge: 0.314579 -0.208174 -0.133864 0.527828 0.234750 -0.452654 0.442533 -0.016863 -0.048971 -0.187672 -0.077745 0.136158 -0.163478 0.004782 -0.013532 0.025464 -0.047783 0.539113 0.407225 -0.160548 -0.163874 -0.081609 -0.089862 0.105340 0.108860
polarizability: 9.25094328e+02 2.60664044e+00 2.73801733e+02 -1.52368218e+00 -3.26815767e+00 1.12631914e+02
1716.lowfreq: -7.9571 -4.0372 -0.0009 0.0015 0.0022 4.8144 19.2993 25.8633 31.5804
frequency: 19.2766 25.7719 31.5486 54.0656 67.0249 77.7365 111.2025 120.4027 130.6916 144.4034 157.2416 170.9236 184.6755 214.7778 216.2740 236.9015 267.1023 271.8477 299.9221 338.1792 344.6891 360.3768 372.0902 388.6396 424.9956 430.0925 444.1037 477.1813 492.0526 494.8737 504.9139 511.9415 514.5338 548.0318 557.1930 586.8691 590.9225 627.5869 633.3975 670.8947 675.5002 719.8921 739.7517 744.9924 760.6565 788.1182 801.9547 823.9517 825.0581 829.2922 846.8562 848.5691 884.2076 887.4196 932.2997 939.4633 961.8124 966.9260 976.6989 980.7802 984.7182 992.5413 1005.9354 1038.2333 1051.7302 1066.3154 1091.8609 1114.8322 1116.5389 1134.3809 1136.2419 1156.5825 1162.8519 1165.1028 1190.2420 1206.5343 1223.1387 1237.1104 1240.6595 1255.3787 1277.8619 1291.8772 1297.9580 1317.7630 1336.3367 1369.5975 1377.2026 1389.8675 1400.6883 1413.5983 1431.0680 1432.9728 1436.9478 1443.2078 1454.2687 1468.0893 1471.8849 1474.6120 1484.5261 1487.4387 1493.0909 1498.2423 1506.5254 1521.2840 1528.8543 1542.3557 1572.9320 1583.9104 1595.0711 1627.1734 1639.0062 2974.7251 2979.5849 3011.0805 3053.3487 3055.9228 3084.4218 3113.0887 3122.5990 3131.3001 3132.8394 3135.4057 3139.8304 3140.2411 3150.4294 3151.2607 3152.4414 3173.7809 3176.7637 3178.7840 3182.6644 3201.3295
redmass: 3.9545 4.1941 5.0183 3.8230 2.0826 3.9224 4.0857 5.3464 1.1977 5.2573 3.0614 1.5019 3.1441 1.8014 3.5790 2.5360 4.1359 2.6535 3.5482 3.8732 3.8582 4.3311 3.8309 3.6361 3.1097 3.1810 3.7726 5.0656 4.8204 4.1098 3.9883 2.7344 4.0734 3.8585 5.2082 5.4462 4.7866 7.2011 7.0351 5.4903 5.1913 4.9084 3.8775 3.8880 1.2764 3.2386 1.2958 1.3867 3.5332 2.0340 1.6925 5.4081 4.4067 1.7223 3.0953 1.2610 1.3343 1.3573 1.3927 1.4438 3.0927 5.3941 1.3732 2.6161 1.5835 2.2999 1.2344 1.3521 1.3380 1.8050 1.7050 2.3791 1.2742 1.6718 1.1449 1.2675 1.9425 2.4891 1.9978 1.6755 1.6853 1.4516 3.0449 2.3904 1.4335 2.6632 2.6787 2.9177 5.7055 5.0613 1.9661 1.1982 1.7816 1.9625 1.2445 1.0398 1.7213 1.3914 1.0447 1.3259 1.9143 1.0908 1.3772 3.3624 5.2899 3.1845 7.4932 5.8482 4.5349 6.4829 6.1995 1.0364 1.0385 1.0362 1.1005 1.1033 1.0894 1.1005 1.0983 1.0906 1.0961 1.1014 1.0892 1.0884 1.0882 1.0900 1.0897 1.0981 1.0980 1.0938 1.0944 1.0930
irintensity: 0.2991 0.2550 0.1170 0.5913 0.1530 0.8110 0.5347 0.1593 3.1169 1.5965 0.1866 0.3486 7.1054 1.3024 0.7208 1.0037 0.9283 2.7038 2.0625 3.3787 1.4755 5.2342 2.8213 0.2239 1.6685 1.9719 1.4831 25.2924 11.9139 1.4540 2.0122 8.3715 7.3917 28.2018 6.8258 1.9300 1.1998 2.0068 0.1343 8.8316 6.5598 30.8738 33.9423 21.5652 29.1540 20.5743 0.0760 65.0073 37.5340 79.6801 3.0332 2.2104 19.4719 13.6387 28.8324 35.9882 0.5681 1.0764 8.7878 3.7898 1.1892 17.5550 0.4901 10.2103 21.2285 8.7873 0.0151 0.6699 8.6333 21.4549 11.8362 25.7488 3.6301 7.7787 3.4753 373.6194 4.4014 16.6205 3.8331 57.4294 7.3062 383.1475 8.9968 86.5086 92.5625 10.7421 71.1046 452.7073 11.2458 3.3177 13.1479 13.2989 14.2482 46.5243 57.9552 0.2048 16.4062 13.8252 34.0318 19.1462 143.2707 75.3924 7.0390 21.5977 37.4931 1095.1639 87.5677 72.3855 1666.0093 3.0097 256.9430 42.2645 158.6417 16.5337 0.0118 41.3673 3.2845 6.8588 2.3690 4.8886 31.6598 0.2858 1.0581 1.7955 3.8788 1.3500 5.6614 19.7178 6.4990 9.1701 13.4914 8.7574
temp: 298.150 k
press: 1.00000 atm
elementType: 16 7 7 6 6 6 6 6 6 6 6 6 6 6 6 6 6 6 6 6 6 6 6 6 6 1 1 1 1 1 1 1 1 1 1 1 1 1 1 1 1 1 1 1 1 1
symmnumber: 1
zpe: 976323.4 jmol-1
zpe.correction: 0.371862 hartree
zpe.thermalcorrener: 0.394354 hartree
zpe.thermalcorrenthalpy: 0.395298 hartree
zpe.thermalcorrgfe: 0.318699 hartree
zpe.sumelectzpe: -1356.553610 hartree
zpe.sumelectthermal: -1356.531119 hartree
zpe.sumelectthermalent: -1356.530174 hartree
zpe.sumelectthermalfe: -1356.606773 hartree
dipole: 5.3533 2.2355 0.3598
dipole: 5.8124
quadrupole: 22.3992 -118.4604 -160.6906
quadrupole: 3.2467 -0.9914 -0.3620
quadrupole: 107.9832 -32.8765 -75.1067 3.2467 -0.9914 -0.3620
hfenergy: -1356.9254723 hartree
pointgroup: C01 [X(C22H21N2S1)]
dipole: -2.1051527 -0.8841661 0.1263306 debye
polarizability: 925.0652069|3.6204881|273.7364463|4.233056|4.7901232|112.7263216 unknown
InChI: InChI=1S/C22H21N2S/c1-23(2)18-12-8-16(9-13-18)10-15-21-24(3)22-19-7-5-4-6-17(19)11-14-20(22)25-21/h4-15H,1-3H3
charge 1 multiplicity 1
46 atoms
S  1.120532 2.018944 -0.094458
N  1.725607 -0.538408 0.141211
N  -7.39949 -0.446325 -0.120458
C  2.99505 0.107308 0.027762
C  4.309709 -0.493148 -0.03523
C  2.857246 1.510058 -0.033289
C  5.439122 0.425768 -0.005628
C  0.621405 0.290114 0.037846
C  3.959047 2.400953 -0.040243
C  5.236184 1.847662 0.006399
C  4.590101 -1.893377 -0.182892
C  1.555514 -1.952503 0.553617
C  6.772232 -0.097302 -0.031883
C  -0.731377 -0.134062 0.030255
C  5.905613 -2.366687 -0.224672
C  7.009209 -1.469213 -0.125468
C  -1.824095 0.739091 0.066308
C  -3.215257 0.394688 0.012387
C  -6.04928 -0.171091 -0.078036
C  -3.707221 -0.950148 -0.112692
C  -4.196787 1.441241 0.087542
C  -5.069148 -1.229366 -0.15776
C  -5.563694 1.180026 0.046079
C  -7.881298 -1.837321 -0.253906
C  -8.390186 0.647093 -0.030642
H  3.808531 3.483147 -0.070881
H  6.113496 2.502481 0.024572
H  3.784861 -2.617481 -0.31147
H  2.391369 -2.238597 1.20708
H  0.627894 -2.048499 1.136904
H  1.511272 -2.627199 -0.318389
H  7.610263 0.60738 0.005727
H  -0.913944 -1.21074 -0.041677
H  6.088771 -3.438864 -0.348435
H  8.032516 -1.855668 -0.147839
H  -1.611654 1.81623 0.151105
H  -3.004087 -1.787558 -0.180097
H  -3.856949 2.47991 0.181588
H  -5.393726 -2.267996 -0.256208
H  -6.265752 2.014418 0.107951
H  -8.980445 -1.841404 -0.269092
H  -7.549169 -2.462413 0.596106
H  -7.525147 -2.298393 -1.194164
H  -9.404022 0.224544 -0.075729
H  -8.279076 1.361186 -0.868143
H  -8.291736 1.200719 0.92184
