program: Gaussian 09
title: 000295563
version: EM64L-G09RevD.01
frameworkgroup: C1[X(C22H29NO4S)]
method: RPBEPBE
basis: SDD
operation: Freq
keyword: #p
keyword: freq=noraman
keyword: PBEPBE/SDD
title: #p freq=noraman PBEPBE/SDD
converged: YES YES NO NO
title: Mulliken charges:
elementType: S O O O O N C C C C C C C C C C C C C C C C C C C C C C H H H H H H H H H H H H H H H H H H H H H H H H H H H H H
charge: 0.934448 -0.516221 -0.507874 -0.448370 -0.261603 -0.488029 -0.360108 -0.368045 -0.376012 -0.461205 -0.373242 -0.352877 0.517838 -0.356885 0.006096 -0.350334 -0.347486 -0.697139 -0.273829 -0.223328 -0.370381 -0.338553 0.264355 -0.335133 -0.393695 0.454696 -0.797753 0.101972 0.203320 0.219395 0.224640 0.202554 0.191393 0.186097 0.282630 0.222911 0.197416 0.191163 0.185501 0.187401 0.195556 0.197104 0.267718 0.241033 0.209575 0.208632 0.214859 0.292913 0.269924 0.270489 0.273159 0.246139 0.245686 0.238353 0.229390 0.242461 0.381283
chargesum: 0.00000
title: Mulliken charges with hydrogens summed into heavy atoms:
elementType: S O O O O N C C C C C C C C C C C C C C C C C C C C C C
charge: 0.934448 -0.516221 -0.507874 -0.067086 -0.261603 -0.488029 0.062608 0.059149 0.001478 0.044336 0.015337 0.020025 0.517838 0.035775 0.006096 -0.082616 -0.106454 -0.064073 0.019084 0.046596 -0.099892 -0.065393 0.264355 -0.088993 -0.148009 0.454696 -0.087549 0.101972
polarizability: 3.16137721e+02 -1.39547243e+01 3.14161106e+02 2.24720064e+01 -1.17767395e+01 2.62031273e+02
1716.lowfreq: -38.3266 -7.7877 -0.0008 0.0007 0.0012 2.0533 5.6577 11.3573 17.0296
frequency: -38.2948 9.9614 15.4183 17.4813 29.5096 40.9128 43.6537 48.9649 53.8090 72.2215 77.5120 86.8333 100.5101 102.4854 113.8348 120.3164 143.0409 149.9936 160.9798 174.1203 177.3165 220.3723 221.2501 229.2357 229.8400 254.1979 281.0268 283.7346 291.5484 317.4101 338.0913 361.3211 380.8258 388.1607 404.5760 411.0438 415.7254 440.6031 459.0486 472.8160 492.2551 496.6506 508.0637 543.6270 581.6272 585.9389 606.3943 620.7460 630.0410 687.1239 702.2766 706.0874 720.8874 728.7232 754.0268 759.6214 775.1843 785.2984 804.3723 816.3349 823.2869 833.1401 845.9656 858.6990 866.6570 890.6189 900.7255 930.8636 954.2761 956.6844 977.6204 983.6228 986.0600 988.6386 993.7320 994.6447 1000.4681 1005.7025 1020.9071 1030.7155 1049.6443 1050.3106 1055.6989 1066.2994 1080.5050 1084.7093 1119.1908 1120.1019 1132.1983 1146.9220 1152.4715 1185.6905 1190.6767 1210.1702 1214.9267 1218.3590 1232.7393 1250.3001 1267.6101 1280.9604 1284.2814 1294.0276 1297.4756 1298.1593 1304.7601 1317.9734 1322.4652 1323.0664 1348.3538 1356.3944 1358.5182 1365.3868 1370.0071 1380.8160 1388.4136 1390.6719 1400.6803 1435.8846 1457.4776 1462.4444 1463.9188 1469.0998 1469.5414 1472.6892 1474.3138 1474.5741 1476.6709 1477.2902 1484.6815 1489.4870 1495.3784 1559.0112 1593.0962 1596.2371 1615.8512 1639.1451 2948.9333 2951.2117 2959.5420 2964.5649 2968.8442 2970.6048 2971.4894 2980.9382 2984.2781 2985.4580 2992.8236 3008.9157 3018.1867 3030.6246 3037.4284 3047.0895 3064.0818 3067.1132 3069.6134 3094.2104 3137.4624 3141.2375 3150.6833 3156.5957 3163.0193 3167.1284 3171.5697 3178.6526 3534.4629
redmass: 1.0222 5.1775 5.2110 5.4015 4.1757 4.2704 5.3969 1.6621 4.0988 4.4459 3.9614 5.3061 4.0838 2.2674 3.7054 3.1967 5.8555 1.9138 3.0893 3.9057 7.1253 5.1531 7.7200 1.1279 7.4590 5.3760 4.9831 4.5743 4.2799 4.4742 2.9307 3.8551 3.7146 5.6463 2.9090 5.8686 3.1609 4.9385 2.8083 4.1444 4.9768 2.8185 3.3375 3.3766 1.4449 3.8526 3.7371 6.9311 6.4658 3.8556 3.7469 3.6774 1.0660 1.1199 1.6769 2.3736 5.0859 3.0758 9.4960 1.3747 1.4136 1.3219 1.2966 1.7062 1.7824 1.8825 1.5749 7.6211 1.3938 1.7701 1.3564 1.3724 1.8728 2.2669 2.5633 2.0290 3.4835 1.4235 2.6688 3.4831 1.6515 2.2970 2.5303 2.9199 2.0922 2.3662 2.3949 1.2873 1.4907 1.7576 1.5772 1.1379 1.6676 1.1974 1.2778 3.0294 1.3960 1.3182 1.3561 1.1194 1.2385 1.1678 1.2961 1.2924 1.3717 1.4374 2.4798 1.4086 1.4804 1.6331 1.6609 1.9057 2.2549 4.3750 1.2196 3.0718 1.3163 3.8718 1.0814 1.0735 1.0700 1.0470 1.0776 2.3415 1.0975 1.1011 1.0472 1.0725 1.0855 1.0939 2.6259 7.1723 6.1716 6.6732 6.2099 8.3747 1.0589 1.0588 1.0595 1.0598 1.0578 1.0381 1.0598 1.0619 1.0376 1.0964 1.0993 1.1008 1.1029 1.1025 1.1019 1.1029 1.0974 1.1007 1.0992 1.0991 1.0893 1.0892 1.0890 1.0874 1.0955 1.0969 1.0956 1.0968 1.0641
irintensity: 0.4294 0.8437 0.4008 0.9688 0.1627 0.7473 1.3138 0.0537 0.0572 0.1742 0.1344 1.6294 0.4342 0.2708 0.1122 0.6378 1.9261 0.0521 1.2765 0.1554 0.5441 0.8318 2.6802 0.0995 17.6923 1.0181 3.7321 3.7402 2.0175 8.2643 9.0778 9.3383 9.5213 27.1800 0.4366 14.8567 3.9651 87.5907 0.1011 44.2146 13.7239 23.9938 116.0331 19.9521 87.5024 5.0567 125.5545 2.0430 0.6334 68.3219 11.9891 18.7459 14.0172 0.5455 11.8689 24.8597 15.5988 25.8385 147.0557 22.8068 1.3652 5.7077 19.7849 25.1326 34.9748 2.8615 4.0577 44.0587 3.5520 8.6928 1.0558 3.6567 1.3987 120.9730 14.2559 40.3459 2.5459 25.2082 127.5833 57.2686 12.6883 36.8251 9.9762 18.8796 1.8986 10.0407 7.7876 8.9350 12.0003 11.8237 198.2047 13.1811 0.3629 10.7933 18.3685 5.6992 2.7166 13.3305 14.5057 11.0197 16.2652 11.9590 19.9036 16.7195 74.1218 29.6934 117.8754 31.3341 0.8862 48.5250 17.2105 18.1378 11.6576 3.7564 11.1640 10.5113 15.8663 17.0283 3.0325 0.4465 0.5150 14.7051 3.0561 22.2867 40.3722 1.4833 11.1458 2.2635 3.8621 27.5702 120.5632 2.4630 12.3122 1.6884 294.4206 337.8858 1.3375 11.0021 8.6221 0.8135 50.2361 47.6591 87.4404 60.8652 21.1451 2.7677 0.5832 1.9894 4.8778 3.8998 44.0280 114.0288 14.0248 97.9231 54.4544 16.1213 9.3950 8.5649 0.4279 4.4537 2.6600 5.8317 1.8770 4.9895 53.2538
temp: 298.150 k
press: 1.00000 atm
elementType: 16 8 8 8 8 7 6 6 6 6 6 6 6 6 6 6 6 6 6 6 6 6 6 6 6 6 6 6 1 1 1 1 1 1 1 1 1 1 1 1 1 1 1 1 1 1 1 1 1 1 1 1 1 1 1 1 1
symmnumber: 1
zpe: 1218531.2 jmol-1
zpe.correction: 0.464114 hartree
zpe.thermalcorrener: 0.493904 hartree
zpe.thermalcorrenthalpy: 0.494848 hartree
zpe.thermalcorrgfe: 0.398521 hartree
zpe.sumelectzpe: -1607.188960 hartree
zpe.sumelectthermal: -1607.159170 hartree
zpe.sumelectthermalent: -1607.158226 hartree
zpe.sumelectthermalfe: -1607.254553 hartree
dipole: -4.3192 -0.2584 2.7831
dipole: 5.1447
quadrupole: -149.1723 -189.9121 -168.8940
quadrupole: 14.1901 3.8182 9.1397
quadrupole: 20.1539 -20.5860 0.4321 14.1901 3.8182 9.1397
hfenergy: -1607.6530739 hartree
pointgroup: C01 [X(C22H29N1O4S1)]
dipole: -1.7280011 0.0651509 -1.0519825 debye
polarizability: 310.3986983|17.5669668|322.5814822|-18.4603146|-2.2553115|259.3499202 unknown
InChI: InChI=1S/C22H29NO4S/c1-3-4-5-6-7-8-17-23(20-13-11-19(12-14-20)22(24)25)28(26,27)21-15-9-18(2)10-16-21/h9-16,24H,3-8,17H2,1-2H3
charge 0 multiplicity 1
57 atoms
S  -0.708537 2.119511 0.098922
O  -0.570308 3.599952 -0.559259
O  0.0956 1.778282 1.47571
O  -0.908128 -5.392804 -2.070113
O  -1.161176 -5.324311 0.238368
N  -0.269716 0.971981 -1.334808
C  2.765369 1.679664 -1.14004
C  2.015498 1.230839 -2.41307
C  4.260472 1.290408 -1.158295
C  0.517609 1.613538 -2.412112
C  5.014544 1.727131 0.117734
C  6.505929 1.322551 0.116278
C  -0.39053 -0.424776 -1.180342
C  7.257769 1.756278 1.395315
C  -2.527896 1.72009 0.382186
C  -0.57168 -1.05116 0.090791
C  -0.364231 -1.249916 -2.350545
C  8.746252 1.345321 1.389893
C  -2.903813 1.232119 1.643222
C  -3.438823 1.997924 -0.647465
C  -0.759829 -2.438807 0.175353
C  -0.546732 -2.636635 -2.250225
C  -0.757431 -3.25145 -0.987905
C  -4.275243 0.988938 1.867013
C  -4.805479 1.741414 -0.397493
C  -5.242041 1.233238 0.854608
C  -6.710428 0.953731 1.114138
C  -0.959446 -4.706847 -0.838704
H  2.670049 2.778899 -1.02343
H  2.285645 1.232553 -0.24564
H  2.125808 0.136334 -2.545789
H  2.476478 1.705461 -3.303851
H  4.350245 0.190138 -1.278165
H  4.750851 1.741753 -2.046718
H  0.403519 2.706396 -2.278428
H  0.040633 1.363373 -3.38065
H  4.51485 1.285971 1.004921
H  4.932884 2.828092 0.233411
H  7.008008 1.765307 -0.769814
H  6.587459 0.221135 0.000879
H  7.177021 2.856645 1.509532
H  6.753971 1.315333 2.27954
H  -0.504235 -0.461567 1.00877
H  -0.218173 -0.797226 -3.335026
H  8.853447 0.247104 1.306445
H  9.279642 1.799174 0.533052
H  9.259496 1.665655 2.315362
H  -2.151159 1.060231 2.419284
H  -3.1025 2.39918 -1.608448
H  -0.891751 -2.921049 1.149666
H  -0.534431 -3.258261 -3.150148
H  -4.597718 0.604801 2.841544
H  -5.539866 1.942192 -1.185268
H  -7.068625 1.496638 2.008077
H  -7.340336 1.253538 0.260176
H  -6.881917 -0.123253 1.298571
H  -1.051371 -6.360551 -1.892208
