program: Gaussian 09
title: 000295548
version: EM64L-G09RevD.01
frameworkgroup: C1[X(C14H24O6)]
method: RPBEPBE
basis: SDD
operation: Freq
keyword: #pfreq=noraman
keyword: PBEPBE/SDD
title: #p freq=noraman PBEPBE/SDD
converged: YES YES NO NO
title: Mulliken charges:
elementType: O O O O O O C C C C C C C C C C C C C C H H H H H H H H H H H H H H H H H H H H H H H H
charge: -0.267144 -0.271027 -0.267386 -0.243462 -0.216606 -0.256241 0.069305 -0.487664 -0.172255 -0.721631 0.237390 0.234992 -0.751444 0.276181 -0.262213 -0.266148 -0.259673 -0.666834 -0.657888 -0.670293 0.269356 0.220631 0.280034 0.220342 0.245054 0.239796 0.235195 0.231175 0.223435 0.237542 0.224423 0.234085 0.221227 0.219692 0.235888 0.220937 0.248578 0.225673 0.210962 0.254732 0.234195 0.222582 0.250529 0.213976
chargesum: 0.00000
title: Mulliken charges with hydrogens summed into heavy atoms:
elementType: O O O O O O C C C C C C C C C C C C C C
charge: -0.267144 -0.271027 -0.267386 -0.243462 -0.216606 -0.256241 0.069305 0.002322 0.107779 -0.016440 0.237390 0.234992 -0.061639 0.276181 0.199752 0.189165 0.195908 0.028354 0.042002 0.016794
polarizability: 1.90865747e+02 -9.17988678e+00 1.70638715e+02 3.52662789e+00 -4.01069702e+00 1.50001359e+02
1716.lowfreq: -24.4707 -10.2391 -3.6013 -0.0004 0.0001 0.0007 3.8056 18.0292 22.4256
frequency: -20.1162 14.8215 21.3439 37.5712 40.6089 48.1365 63.0775 71.6707 86.8983 92.9933 101.6952 109.6317 144.9219 162.5806 174.0590 205.3240 208.8125 215.6908 228.9518 234.0425 243.1022 244.1317 256.6544 300.0725 307.7105 315.6430 317.8567 349.1223 361.4857 397.9657 424.4154 434.2888 471.2588 497.5079 552.4797 632.1353 655.5959 706.8102 710.8161 729.0414 743.1191 762.8664 783.5898 814.0638 816.3338 820.4497 834.7117 846.2106 866.7237 905.8104 937.5279 972.2674 1008.9442 1010.1185 1015.3605 1038.2761 1054.6163 1077.4419 1089.8050 1096.5755 1096.8572 1100.5327 1119.3029 1120.6260 1141.7860 1155.4722 1156.8046 1158.1553 1175.6898 1206.7291 1272.4198 1275.9280 1276.2166 1276.8784 1293.8493 1328.5098 1348.9618 1352.1977 1353.7135 1367.7720 1383.2487 1386.0164 1389.6595 1392.7685 1394.7395 1455.4776 1455.8534 1458.8287 1460.3302 1461.7939 1463.0695 1463.2227 1471.8896 1474.5344 1478.2527 1481.6023 1483.8638 1484.2573 1486.6488 1613.0977 1633.5403 1639.8464 2979.0135 2989.4669 2992.1312 2995.1545 2999.6329 3001.8861 3029.4567 3029.6091 3032.2379 3041.9731 3061.3778 3078.3019 3083.6143 3087.1353 3088.1929 3090.6944 3091.2727 3093.0820 3095.8092 3099.0313 3116.9619 3119.9560 3121.5851 3121.7478
redmass: 3.1881 3.4682 3.5586 3.2838 3.1867 3.7864 3.6380 4.6876 3.6134 4.8006 4.8892 4.0717 3.7634 3.2292 2.0228 1.5674 1.5309 1.1581 1.5363 1.5731 1.2657 2.5461 2.0870 2.7387 2.7844 3.0222 3.0742 3.0109 5.6015 3.5741 3.4032 3.7367 4.1676 4.2839 3.5944 3.5426 4.2895 5.3849 5.2408 6.1867 2.9647 2.1179 1.7580 1.6325 1.5599 1.7013 3.0769 2.7343 2.5270 2.0486 1.9078 1.7936 2.5073 2.5753 2.7489 1.8417 2.3895 3.4188 2.9630 2.2488 2.2121 2.4620 4.2970 4.0268 2.2867 1.6942 1.6978 1.6948 2.0079 2.8739 1.6655 1.1189 1.1425 1.1490 1.2730 1.3852 1.2529 1.2719 1.2858 1.4857 1.2236 1.2331 1.2286 1.2034 1.2257 1.0973 1.0925 1.0846 1.0613 1.0457 1.0431 1.0511 1.0496 1.0635 1.0576 1.0581 1.0534 1.0522 1.0523 9.8527 10.0474 8.5765 1.0346 1.0358 1.0358 1.0366 1.0434 1.0528 1.0591 1.0594 1.0594 1.0853 1.1024 1.0997 1.0975 1.0976 1.1001 1.1027 1.0973 1.1027 1.1037 1.0990 1.1063 1.1068 1.1018 1.1045
irintensity: 0.8065 0.2193 0.3330 0.2481 0.6547 0.8418 1.1006 3.7993 0.1979 0.3675 0.4466 3.6906 0.2493 1.0882 1.9795 3.3056 3.5515 0.6528 1.1390 0.6197 0.3578 0.0749 2.4330 2.5947 8.3939 20.8880 5.4226 15.0292 9.6381 4.6371 1.6387 6.0703 11.0118 1.4680 6.2288 3.6844 3.6515 14.8910 4.8866 0.1364 12.4058 19.0390 0.6096 6.1234 1.0368 5.6740 5.8920 2.4888 2.5005 0.1883 4.1961 9.6332 31.0420 27.1886 35.9554 3.6151 122.4652 438.9961 83.9063 57.2907 0.9639 4.4556 218.3074 114.2555 42.2983 21.7350 22.8028 19.3439 52.5698 81.0476 78.8335 5.0739 3.8406 17.1213 5.3648 23.0830 0.5043 0.5780 0.9849 11.2759 18.4241 14.5555 30.6158 9.5176 24.4877 9.6069 17.3788 12.4379 3.8017 12.1030 20.4018 11.6102 22.1967 18.8629 21.4302 3.9423 7.4971 39.3215 3.3258 120.7830 195.0183 136.1864 25.6968 24.6871 16.4842 17.6627 9.6890 30.8885 20.7335 42.4551 30.8318 2.2997 7.7418 37.4541 36.5513 34.9354 26.0443 2.1780 35.4183 2.1691 1.2520 19.3323 33.1705 30.3998 29.6396 16.4928
temp: 298.150 k
press: 1.00000 atm
elementType: 8 8 8 8 8 8 6 6 6 6 6 6 6 6 6 6 6 6 6 6 1 1 1 1 1 1 1 1 1 1 1 1 1 1 1 1 1 1 1 1 1 1 1 1
symmnumber: 1
zpe: 957586.8 jmol-1
zpe.correction: 0.364726 hartree
zpe.thermalcorrener: 0.388469 hartree
zpe.thermalcorrenthalpy: 0.389413 hartree
zpe.thermalcorrgfe: 0.308882 hartree
zpe.sumelectzpe: -997.646827 hartree
zpe.sumelectthermal: -997.623083 hartree
zpe.sumelectthermalent: -997.622139 hartree
zpe.sumelectthermalfe: -997.702670 hartree
dipole: 2.5621 -0.3126 -1.1847
dipole: 2.8400
quadrupole: -107.6679 -104.2439 -124.8540
quadrupole: -4.6823 6.1198 0.5383
quadrupole: 4.5874 8.0113 -12.5987 -4.6823 6.1198 0.5383
hfenergy: -998.0115523 hartree
pointgroup: C01 [X(C14H24O6)]
dipole: 0.5923004 -0.8277934 0.4608402 debye
polarizability: 174.8851986|-14.4237066|182.8835286|-9.7437247|0.7140165|153.7370936 unknown
InChI: InChI=1S/C14H24O6/c1-6-18-11(15)10(4)9-14(5,12(16)19-7-2)13(17)20-8-3/h10H,6-9H2,1-5H3
charge 0 multiplicity 1
44 atoms
O  1.963713 -2.60445 -0.680214
O  -1.793733 -2.324184 0.33014
O  -0.679552 2.884767 0.316791
O  1.048478 -1.481279 1.142215
O  -2.056432 -0.080203 -0.233964
O  -0.991947 2.564054 -1.971666
C  -0.083175 -1.356788 -1.063585
C  0.401801 -0.012612 -1.706018
C  0.645286 1.173345 -0.728833
C  -0.336534 -2.40032 -2.187985
C  0.992663 -1.819943 -0.063869
C  -1.397198 -1.141775 -0.283208
C  2.028322 1.841714 -0.980076
C  -0.43467 2.241485 -0.896402
C  3.12587 -3.016358 0.171419
C  -3.013898 -2.257146 1.19574
C  -1.688953 3.98608 0.291883
C  4.199275 -1.924996 0.187962
C  -2.644469 -1.766864 2.598137
C  -1.04067 5.313609 -0.112735
H  -0.348679 0.295566 -2.457046
H  1.333948 -0.242615 -2.255038
H  0.615956 0.83368 0.320971
H  -1.131093 -2.033692 -2.862478
H  -0.648932 -3.368493 -1.765654
H  0.583578 -2.551422 -2.774674
H  2.188411 2.692478 -0.294383
H  2.103282 2.210012 -2.019592
H  2.837126 1.106909 -0.813122
H  2.753248 -3.230913 1.188143
H  3.480035 -3.941532 -0.310234
H  -3.749475 -1.590215 0.712379
H  -3.383421 -3.294947 1.199274
H  -2.071512 4.009487 1.324942
H  -2.495433 3.703354 -0.407027
H  5.085075 -2.284113 0.74399
H  3.826199 -1.015918 0.688897
H  4.518009 -1.668919 -0.837396
H  -3.535653 -1.805772 3.252035
H  -2.281448 -0.726318 2.566918
H  -1.856854 -2.400237 3.039936
H  -0.19713 5.560696 0.555383
H  -0.674305 5.266327 -1.15191
H  -1.784308 6.129755 -0.045647
