program: Gaussian 09
title: 000022667
version: EM64L-G09RevD.01
frameworkgroup: C1[X(C13H19NO2)]
method: RPBEPBE
basis: SDD
operation: Freq
keyword: #p
keyword: freq=noraman
keyword: PBEPBE/SDD
title: #p freq=noraman PBEPBE/SDD
converged: YES YES NO NO
title: Mulliken charges:
elementType: O O N C C C C C C C C C C C C C H H H H H H H H H H H H H H H H H H H
charge: -0.289899 -0.280972 -0.097779 -0.021063 -0.538035 -0.506118 0.336786 0.295924 -0.759708 -0.641288 -0.548033 -0.538416 0.196654 0.216340 -0.523265 -0.535270 0.195983 0.205847 0.224928 0.227859 0.187237 0.224992 0.224312 0.216240 0.218584 0.246878 0.185379 0.258172 0.240733 0.255997 0.226688 0.208673 0.224611 0.242178 0.218853
chargesum: 0.00000
title: Mulliken charges with hydrogens summed into heavy atoms:
elementType: O O N C C C C C C C C C C C C C
charge: -0.289899 -0.280972 -0.097779 0.174920 -0.107260 -0.091022 0.336786 0.295924 -0.094164 0.009552 -0.289861 -0.297683 0.196654 0.216340 0.168092 0.150372
polarizability: 2.15086563e+02 1.87736100e+00 1.62613425e+02 1.13709583e+00 3.64177349e-01 9.59612749e+01
1716.lowfreq: -8.6715 -0.0006 0.0005 0.0005 4.8911 11.7984 50.3910 56.7338 78.1122
frequency: 50.3143 56.5539 78.0617 99.1735 127.6894 149.7976 161.6055 187.3782 201.5983 220.4821 231.8971 254.7090 261.6124 276.6860 288.0685 301.6048 342.1616 367.2241 388.1036 406.8400 452.7693 472.2753 486.0635 496.0311 560.6914 612.7104 641.3543 710.1269 722.3381 728.5723 741.0195 808.0421 840.7180 877.1591 910.5074 925.8200 941.7445 984.8539 987.0399 1009.0975 1047.0789 1096.0439 1097.5696 1103.8565 1110.9864 1112.9752 1117.7009 1150.7488 1159.1484 1168.7002 1176.0429 1196.9561 1206.6538 1230.6191 1248.0915 1252.9551 1278.8773 1292.1417 1334.2952 1342.6776 1356.4953 1384.4312 1386.9106 1401.8924 1430.0075 1433.1271 1441.6738 1445.8942 1455.4135 1461.8018 1466.3081 1469.6055 1473.7086 1477.7524 1481.0841 1482.1208 1495.9178 1505.4194 1590.6481 1619.1802 2785.9008 2815.8754 2848.7616 2958.0026 2966.3510 2969.2886 2982.3386 2994.3644 3023.7981 3027.4794 3045.5449 3076.2652 3077.6469 3084.7067 3094.5486 3119.7658 3121.4066 3134.1052 3141.9658
redmass: 3.2712 2.9690 2.2920 3.3411 2.2702 1.8210 2.4865 2.4699 2.5246 1.1683 2.0774 1.4025 1.8085 2.0660 2.7775 4.0263 4.5082 1.7338 3.5493 3.5131 3.5395 2.6642 3.3249 3.8091 4.7389 4.7535 4.7091 3.6927 4.6803 3.4916 4.7156 3.1382 1.4985 1.5029 1.6145 2.2068 4.0524 2.2545 3.9975 1.8323 1.9414 3.2448 3.0597 1.9211 1.2406 1.2612 1.4925 1.4306 1.4665 1.8531 1.4617 3.1726 1.9565 1.6791 1.3404 1.4739 1.7125 2.6974 1.3298 1.8610 1.9798 1.5101 2.9204 2.2723 1.2373 1.1706 1.0990 1.3822 1.0638 1.0855 1.0507 1.0495 1.0909 1.0898 1.0500 1.0532 1.0507 2.9628 7.9763 7.0926 1.0716 1.0799 1.0583 1.0328 1.0601 1.0350 1.0364 1.0847 1.0995 1.0735 1.1038 1.0972 1.0990 1.0999 1.0977 1.0993 1.1041 1.0899 1.0916
irintensity: 2.6321 1.0344 3.1409 8.2326 0.5584 0.5499 2.5824 2.6638 1.2054 1.6442 0.4720 0.2023 2.1892 7.6521 1.9677 2.8669 6.0451 0.7070 3.1899 4.3086 4.8292 0.2036 5.2998 0.7077 4.5984 0.7129 2.1905 12.5992 1.7853 5.7000 8.3270 8.4671 23.6562 7.8996 7.7059 10.1365 46.0896 23.7096 43.6249 14.6372 13.8444 49.8888 5.8624 16.0427 10.6948 0.2387 11.9104 5.1582 12.2260 52.3039 32.6612 42.4030 30.0245 7.0397 24.0502 4.8689 44.3316 111.6968 20.8131 26.7012 21.3703 20.4611 19.2346 9.1415 1.2415 5.0280 7.6872 10.7079 11.0382 22.0020 14.5394 17.4569 70.3679 7.6542 10.3128 21.6206 6.7457 151.6580 0.7391 12.4894 65.8692 77.4850 179.2887 68.3806 28.4542 94.6320 36.2647 26.8265 26.3157 45.3163 48.1363 39.3232 35.8877 34.4375 34.6595 25.7534 21.9711 14.7757 3.6239
temp: 298.150 k
press: 1.00000 atm
elementType: 8 8 7 6 6 6 6 6 6 6 6 6 6 6 6 6 1 1 1 1 1 1 1 1 1 1 1 1 1 1 1 1 1 1 1
symmnumber: 1
zpe: 775252.7 jmol-1
zpe.correction: 0.295278 hartree
zpe.thermalcorrener: 0.311809 hartree
zpe.thermalcorrenthalpy: 0.312753 hartree
zpe.thermalcorrgfe: 0.252013 hartree
zpe.sumelectzpe: -710.704025 hartree
zpe.sumelectthermal: -710.687495 hartree
zpe.sumelectthermalent: -710.686550 hartree
zpe.sumelectthermalfe: -710.747291 hartree
dipole: -0.5707 2.6371 0.5026
dipole: 2.7445
quadrupole: -86.3836 -86.1633 -100.3803
quadrupole: 6.6910 7.0862 -2.3841
quadrupole: 4.5921 4.8124 -9.4046 6.6910 7.0862 -2.3841
hfenergy: -710.9993036 hartree
pointgroup: C01 [X(C13H19N1O2)]
dipole: 0.2286939 1.0323846 -0.2186432 debye
polarizability: 214.9375103|-1.6882658|162.5417772|4.4668656|-2.15414|96.1819751 unknown
InChI: InChI=1S/C13H19NO2/c1-9-5-10-6-12(15-3)13(16-4)7-11(10)8-14(9)2/h6-7,9H,5,8H2,1-4H3
charge 0 multiplicity 1
35 atoms
O  -3.026963 -1.759907 0.207234
O  -3.232482 1.068797 -0.005777
N  3.003569 0.622696 -0.407827
C  3.092876 -0.605529 0.439312
C  1.920771 -1.540953 0.060293
C  1.785846 1.408559 -0.092624
C  0.575965 -0.834736 0.039074
C  0.514385 0.573899 -0.061481
C  4.429738 -1.347428 0.251737
C  4.190934 1.499259 -0.353274
C  -0.634051 -1.56887 0.092367
C  -0.745207 1.222275 -0.088614
C  -1.892031 -0.938729 0.059405
C  -1.948811 0.487682 -0.020175
C  -4.090962 -1.631969 -0.809928
C  -3.309317 2.529985 0.010175
H  2.991385 -0.327668 1.523601
H  1.890478 -2.392843 0.767518
H  2.136917 -1.959284 -0.943959
H  1.687885 2.20714 -0.854015
H  1.893095 1.929125 0.89993
H  4.620563 -1.52498 -0.822965
H  5.286427 -0.796339 0.676408
H  4.38151 -2.328359 0.758741
H  4.023264 2.370227 -1.012946
H  5.083905 0.970168 -0.721789
H  4.410586 1.887295 0.675123
H  -0.622533 -2.661978 0.168253
H  -0.773835 2.315615 -0.155578
H  -4.524692 -0.618505 -0.803194
H  -4.84723 -2.379394 -0.524475
H  -3.692514 -1.86762 -1.816424
H  -2.787938 2.94894 0.89265
H  -4.383359 2.761228 0.069941
H  -2.885275 2.969002 -0.914316
