program: Gaussian 09
title: 000296414
version: EM64L-G09RevD.01
frameworkgroup: C1[X(C18H17N5O2)]
method: RPBEPBE
basis: SDD
operation: Freq
keyword: #p
keyword: freq=noraman
keyword: PBEPBE/SDD
title: #p freq=noraman PBEPBE/SDD
converged: YES YES NO NO
title: Mulliken charges:
elementType: O O N N N N N C C C C C C C C C C C C C C C C C C H H H H H H H H H H H H H H H H H
charge: -0.286890 -0.288603 -0.443687 -0.107767 0.029759 -0.623992 -0.636147 -0.353574 0.451222 0.405587 0.427139 -0.411680 -0.408315 -0.387424 -0.367889 0.048595 -0.452578 -0.233111 -0.229159 -0.238568 -0.229815 0.087394 0.178763 -0.243551 -0.235846 0.225907 0.366347 0.238695 0.237694 0.264521 0.254032 0.249869 0.226503 0.228475 0.229605 0.227765 0.229857 0.230762 0.370117 0.321882 0.329674 0.318435
chargesum: 0.00000
title: Mulliken charges with hydrogens summed into heavy atoms:
elementType: O O N N N N N C C C C C C C C C C C C C C C C C C
charge: -0.286890 -0.288603 -0.077340 -0.107767 0.029759 0.068007 0.011962 -0.127667 0.451222 0.405587 0.427139 -0.172985 -0.170622 -0.122903 -0.113856 0.048595 -0.202710 -0.006608 -0.000683 -0.008963 -0.002050 0.087394 0.178763 -0.013694 -0.005085
polarizability: 2.91165508e+02 1.00755242e+01 2.76088071e+02 -3.57069611e+00 -1.91535677e+01 1.88433776e+02
1716.lowfreq: -14.0605 -8.8141 -0.0003 0.0004 0.0007 4.6884 19.5772 21.0069 28.2528
frequency: 18.8608 20.6808 28.1742 38.9081 51.9337 57.5987 71.0379 94.1589 142.3003 159.6922 197.6563 206.7616 228.1408 234.1761 265.2879 282.1207 299.0098 311.2204 366.7190 375.1991 402.4852 404.3098 413.7064 416.1941 460.7623 474.4320 508.2825 516.4686 548.4851 569.6643 591.4984 596.5242 613.0874 615.4596 627.2435 636.8555 654.5849 656.2983 683.9059 684.7703 705.6327 707.6433 729.1454 748.2103 752.9000 768.0127 774.1056 787.1378 790.8425 832.6164 855.5272 859.7931 869.0846 925.7665 933.0870 948.9351 980.2238 982.2274 990.5969 991.6265 998.5970 999.9122 1008.5720 1024.2774 1026.6463 1055.6595 1076.3970 1082.2666 1087.7250 1145.7962 1152.3009 1172.4322 1173.2847 1183.6410 1188.0192 1190.8338 1208.6749 1212.2416 1253.8524 1270.0771 1277.7206 1300.5955 1329.1161 1341.8115 1344.4996 1381.5205 1388.2105 1416.3917 1436.9758 1441.8359 1474.4899 1480.4375 1481.7798 1490.2759 1498.9971 1550.0687 1576.5240 1592.5739 1595.2602 1603.0239 1610.7843 1613.6105 1622.2267 2938.5833 3112.6665 3118.4196 3126.7978 3127.9009 3138.2716 3139.8582 3149.1212 3150.7094 3164.1090 3165.2094 3177.2531 3289.1364 3385.5200 3551.4089 3636.0223 3706.2438
redmass: 3.7855 6.2684 5.7154 3.9749 5.8404 5.2508 6.3313 10.5248 5.5225 5.2048 6.0780 5.5623 4.5049 4.6881 5.4114 4.9091 4.5395 6.3633 3.6029 10.0371 2.8188 2.8207 4.6870 1.2598 4.2603 3.7746 1.1014 5.9294 4.5571 1.2696 4.6871 4.5693 6.0903 6.3987 4.8674 6.3467 4.0123 5.6286 4.9293 5.5157 1.7458 1.8301 2.3001 2.1524 1.2696 4.8035 2.1531 1.7802 1.3876 3.8026 1.2465 1.2486 3.5304 1.4366 1.5688 2.5067 1.3954 1.4068 5.7867 5.9686 1.3360 1.3323 2.7995 2.2851 2.1917 2.5637 3.7022 1.6346 1.7074 2.7092 3.0364 1.0543 1.0547 1.4438 1.6049 1.2021 4.5708 2.6584 6.1375 1.6067 1.8224 1.3558 1.4316 1.8013 1.6841 7.1742 5.8627 3.4054 2.1818 2.1217 3.4373 2.2706 2.2523 3.5748 2.3179 2.0643 2.7765 6.1407 6.0060 3.8882 5.8858 5.1692 1.6703 1.0823 1.0876 1.0873 1.0861 1.0866 1.0913 1.0915 1.0954 1.0959 1.1013 1.1015 1.0917 1.0803 1.0545 1.0449 1.0961 1.1048
irintensity: 0.0270 1.5275 0.1796 0.0391 1.2516 0.0615 0.0735 0.0024 1.3514 3.0745 1.6213 8.3525 1.1041 0.9083 3.3258 0.9133 0.5124 3.7935 19.0279 1.0966 0.2539 0.0930 11.4203 145.7948 0.2449 5.2582 67.0262 13.3444 5.0631 187.1091 14.1851 28.1675 1.2057 1.9368 22.9581 9.4574 8.9387 32.6137 1.5251 3.0706 58.5068 42.7766 15.0878 39.8097 29.8645 16.9310 22.7137 172.5582 3.4117 11.4110 0.4389 0.2881 3.5137 1.5200 6.9991 21.1211 0.0321 0.0013 0.8646 1.9053 0.3338 0.0977 2.3840 8.2220 10.8542 8.0453 33.1017 4.4174 14.3191 97.2163 2.7152 0.3565 0.0220 12.7493 1.0341 4.2762 135.4633 28.3275 306.8518 19.3335 161.1890 16.3766 0.6108 4.7031 48.7013 3.8668 8.1894 50.6203 15.2190 14.7116 35.6277 14.7769 17.1963 121.9110 91.3220 108.8660 951.1851 21.1890 22.8850 338.4824 13.6775 4.7707 587.4208 19.1062 7.3257 6.8397 0.1242 0.1727 14.2005 15.5814 28.6622 29.8546 28.7057 23.4939 4.3351 122.1456 80.1535 132.6654 88.4152 33.5566
temp: 298.150 k
press: 1.00000 atm
elementType: 8 8 7 7 7 7 7 6 6 6 6 6 6 6 6 6 6 6 6 6 6 6 6 6 6 1 1 1 1 1 1 1 1 1 1 1 1 1 1 1 1 1
symmnumber: 1
zpe: 854701.5 jmol-1
zpe.correction: 0.325539 hartree
zpe.thermalcorrener: 0.346872 hartree
zpe.thermalcorrenthalpy: 0.347816 hartree
zpe.thermalcorrgfe: 0.272609 hartree
zpe.sumelectzpe: -1118.526277 hartree
zpe.sumelectthermal: -1118.504944 hartree
zpe.sumelectthermalent: -1118.503999 hartree
zpe.sumelectthermalfe: -1118.579207 hartree
dipole: -1.3842 5.3167 -3.2180
dipole: 6.3670
quadrupole: -130.4458 -140.7494 -139.4715
quadrupole: 11.6359 -5.7206 3.8770
quadrupole: 6.4431 -3.8605 -2.5826 11.6359 -5.7206 3.8770
hfenergy: -1118.8518156 hartree
pointgroup: C01 [X(C18H17N5O2)]
dipole: -0.4797404 -2.0706941 1.3255183 debye
polarizability: 291.7906604|-8.9692723|274.0082336|6.1574632|-21.8501809|189.8884615 unknown
InChI: InChI=1S/C18H17N5O2/c19-15-11-14(17(23(24)25)18(20)22-15)21-16(12-7-3-1-4-8-12)13-9-5-2-6-10-13/h1-11,16,21H,19-20H2
charge 0 multiplicity 1
42 atoms
O  1.085661 2.560936 -1.311715
O  3.331505 2.853171 -1.45261
N  0.080029 0.570241 0.00108
N  4.086795 -0.615925 0.812516
N  2.30626 2.150351 -1.01754
N  4.967153 1.181929 -0.336924
N  3.329715 -2.470881 1.975155
C  -1.108346 -0.089101 0.573765
C  -1.426477 -1.452817 -0.062604
C  -2.286581 0.898791 0.495426
C  1.375148 0.183009 0.251889
C  -2.235835 -2.372475 0.650602
C  -2.396321 1.915681 1.477883
C  -0.961309 -1.803199 -1.351552
C  -3.237026 0.849247 -0.552482
C  2.505745 0.970288 -0.246686
C  1.662064 -0.981485 1.00425
C  -2.578345 -3.619522 0.084109
C  -3.437966 2.866655 1.415805
C  -1.301814 -3.051477 -1.921683
C  -4.278826 1.802192 -0.618097
C  3.853134 0.507681 0.079138
C  3.012248 -1.338537 1.253969
C  -2.111785 -3.963489 -1.207165
C  -4.383248 2.812334 0.364697
H  -0.907824 -0.266311 1.65379
H  -0.015811 1.442187 -0.549744
H  -2.60843 -2.105484 1.648036
H  -1.658482 1.96547 2.288548
H  -0.326355 -1.099265 -1.900489
H  -3.168293 0.063062 -1.312093
H  0.854894 -1.626817 1.354268
H  -3.206567 -4.320619 0.645212
H  -3.511554 3.647238 2.181104
H  -0.933298 -3.31122 -2.920444
H  -5.007429 1.755568 -1.43509
H  -2.375249 -4.931107 -1.648694
H  -5.192118 3.549709 0.313657
H  4.834802 2.036321 -0.892647
H  5.870877 0.795732 -0.069544
H  4.314069 -2.68837 2.114716
H  2.612589 -3.092191 2.33759
