program: Gaussian 09
title: 000296500
version: EM64L-G09RevD.01
frameworkgroup: C1[X(C22H22N2O6)]
method: RPBEPBE
basis: SDD
operation: Freq
keyword: #p
keyword: freq=noraman
keyword: PBEPBE/SDD
title: #p freq=noraman PBEPBE/SDD
converged: YES YES NO NO
title: Mulliken charges:
elementType: O O O O O O N N C C C C C C C C C C C C C C C C C C C C C C H H H H H H H H H H H H H H H H H H H H H H
charge: -0.287946 -0.305674 -0.275943 -0.294055 -0.256972 -0.252053 -0.427633 -0.429283 0.211005 0.221961 0.512177 0.504989 -0.379102 -0.386001 0.062305 0.061659 -0.498822 -0.514429 -0.436507 -0.408013 0.200424 0.203307 0.218180 0.187268 -0.343692 -0.346094 -0.518767 -0.529465 -0.535077 -0.530115 0.268700 0.270897 0.355753 0.351768 0.252976 0.255144 0.239913 0.244218 0.242657 0.253749 0.234456 0.257429 0.213249 0.251504 0.234178 0.226162 0.247584 0.231090 0.224651 0.257858 0.232239 0.226194
chargesum: 0.00000
title: Mulliken charges with hydrogens summed into heavy atoms:
elementType: O O O O O O N N C C C C C C C C C C C C C C C C C C C C C C
charge: -0.287946 -0.305674 -0.275943 -0.294055 -0.256972 -0.252053 -0.071880 -0.077515 0.211005 0.221961 0.512177 0.504989 -0.110401 -0.115104 0.062305 0.061659 -0.245845 -0.259285 -0.196594 -0.163796 0.200424 0.203307 0.218180 0.187268 -0.101035 -0.092345 0.186366 0.182378 0.168248 0.186177
polarizability: 7.40851343e+02 -3.82523779e+01 2.86984046e+02 -6.96486717e-01 5.73617118e+00 1.52107816e+02
1716.lowfreq: -5.3188 -1.7927 -0.0011 -0.0007 0.0010 2.7161 12.5844 19.3668 21.0459
frequency: 12.5541 18.7517 21.0333 40.8803 44.8267 46.8541 57.2986 74.1267 83.6208 104.2204 110.7492 123.0621 124.9452 143.1102 146.8495 156.3870 157.6242 165.6360 176.6547 186.6574 198.3577 202.9951 209.5744 238.2746 249.1083 259.5555 265.8202 296.5140 308.2988 346.2314 348.5889 370.0758 393.7293 408.8839 444.1717 455.2979 471.3398 474.5803 482.3569 487.3440 492.8597 520.2390 541.2045 552.5401 577.1671 601.1989 610.1638 632.1411 642.0346 674.1671 697.1850 705.5120 712.7753 722.2574 732.8036 740.3702 746.3231 759.2382 763.8598 773.5341 779.7021 806.6289 834.7192 888.3816 889.6101 897.4025 901.9761 910.9303 914.0933 919.5822 938.5452 944.9126 962.3116 980.5942 985.1366 1002.3805 1091.5777 1110.5490 1110.9957 1113.9804 1114.2876 1115.5824 1142.6324 1143.7648 1146.7293 1155.0781 1156.3409 1157.9639 1179.0769 1193.4923 1210.5169 1221.8444 1244.0717 1253.0825 1258.1869 1269.5284 1307.6620 1315.3093 1354.3012 1368.9446 1385.8274 1390.0676 1402.9959 1408.8689 1415.6562 1425.3306 1428.2288 1433.4094 1442.4514 1444.5714 1456.9631 1457.8624 1460.2086 1467.6030 1472.4325 1476.3100 1479.1068 1487.1447 1487.5631 1497.6658 1552.1428 1559.8935 1590.7750 1602.0904 1607.2594 1614.5581 1646.3363 1649.0352 2967.6765 2974.0446 2977.4069 2979.1786 3059.9325 3070.0385 3075.4621 3088.7119 3124.6400 3126.1454 3126.3350 3129.0187 3129.7944 3131.2912 3138.1760 3138.3067 3147.3217 3153.9908 3165.3044 3166.4167 3504.7721 3506.2798
redmass: 6.1108 4.3157 5.5840 4.8051 3.8835 4.2514 2.6106 5.2630 4.1009 4.1696 2.8151 2.9003 2.8911 1.8501 1.7545 2.0711 1.4869 3.7388 3.5649 3.5627 4.4653 4.5127 4.4523 1.5392 3.9819 3.9374 4.7083 4.7486 4.1291 4.5595 4.6383 4.9229 4.8669 7.1036 5.8134 4.8490 8.6552 4.4904 3.7207 3.7247 5.1436 5.7918 6.8943 5.9902 5.8050 4.8890 5.6521 4.0411 3.4374 1.8407 5.4902 3.4394 4.5660 5.1204 3.7783 5.7399 3.4068 2.5130 2.1307 6.3731 3.5017 1.5073 1.4797 1.5489 1.5495 4.4321 3.5230 1.5562 1.5519 3.1975 1.4364 6.6690 1.4097 8.3770 3.6937 3.5095 2.9133 1.2389 1.2572 1.3896 2.1418 1.2459 2.4351 1.6187 1.4517 1.3203 1.4719 1.6206 1.9243 1.9527 1.6868 1.8983 3.7528 3.6226 1.4610 1.4199 4.1850 2.4244 5.6111 4.7773 2.6658 1.9854 3.4480 2.9327 1.7569 1.7390 1.3207 1.2480 1.4489 1.4111 1.0716 1.0540 1.0669 1.0511 1.0899 1.0665 1.0548 1.0694 2.7149 2.6506 6.8953 6.9101 7.7178 6.0212 6.6379 5.4079 5.3635 7.8758 1.0324 1.0307 1.0308 1.0345 1.1044 1.1044 1.1041 1.0975 1.1026 1.1031 1.0880 1.0881 1.1000 1.1047 1.0884 1.0887 1.0911 1.0909 1.0950 1.0963 1.0759 1.0760
irintensity: 1.4831 0.2627 0.4602 0.6749 3.6074 0.5434 2.0420 0.1400 3.5031 9.2985 9.3798 3.0835 0.5571 2.5417 2.8976 2.3914 1.0980 2.8244 2.5426 2.0356 4.3481 0.7328 0.5183 2.0295 5.3378 3.1114 2.6724 7.0270 6.1298 0.6595 0.3700 11.4720 7.0715 41.7385 56.1761 12.7015 0.4900 0.8208 6.5702 15.4045 0.5802 33.4824 5.4526 21.4566 5.8982 11.9578 1.1380 17.0079 18.0973 0.5343 20.3898 18.1999 4.1161 13.3145 22.3829 1.2897 8.8888 43.6806 73.2169 8.0122 18.7796 47.7828 33.4460 14.2380 15.9417 38.4536 3.9288 44.2028 15.0887 96.9714 7.3411 105.4544 1.2548 75.6208 55.9885 57.6076 78.9345 9.6839 0.5102 79.6654 50.4138 7.3590 20.2121 7.8176 32.6564 2.7837 12.6744 37.7182 17.6461 11.4917 47.9366 102.1718 167.8082 994.6728 63.4117 0.6203 813.6294 24.8677 240.4408 134.9036 19.3853 267.4158 112.3153 52.1291 155.8882 2.4597 1.3014 0.4095 23.9120 11.7483 13.4038 16.6643 4.6102 16.0458 96.2297 10.3675 27.9311 45.3339 125.9765 157.6747 30.2594 48.7161 16.0935 151.0483 31.3292 405.1704 7.6708 23.7065 106.8050 69.0059 105.2303 95.2424 40.2025 28.3117 22.1683 40.6676 21.5107 30.6644 2.2773 3.7015 25.4971 13.6503 4.4922 6.0008 4.1007 4.4053 20.2428 11.2084 71.3860 3.3022
temp: 298.150 k
press: 1.00000 atm
elementType: 8 8 8 8 8 8 7 7 6 6 6 6 6 6 6 6 6 6 6 6 6 6 6 6 6 6 6 6 6 6 1 1 1 1 1 1 1 1 1 1 1 1 1 1 1 1 1 1 1 1 1 1
symmnumber: 1
zpe: 1052830.6 jmol-1
zpe.correction: 0.401002 hartree
zpe.thermalcorrener: 0.430387 hartree
zpe.thermalcorrenthalpy: 0.431331 hartree
zpe.thermalcorrgfe: 0.337758 hartree
zpe.sumelectzpe: -1410.168226 hartree
zpe.sumelectthermal: -1410.138841 hartree
zpe.sumelectthermalent: -1410.137897 hartree
zpe.sumelectthermalfe: -1410.231470 hartree
dipole: -2.6080 2.2730 1.0955
dipole: 3.6288
quadrupole: -86.6066 -182.4694 -175.3683
quadrupole: -11.0322 2.6832 -6.1397
quadrupole: 61.5415 -34.3213 -27.2202 -11.0322 2.6832 -6.1397
hfenergy: -1410.569228 hartree
pointgroup: C01 [X(C22H22N2O6)]
dipole: -1.0551355 -0.6440472 0.7142838 debye
polarizability: 742.6680439|3.1043475|165.1362263|-25.1420005|-39.8854485|272.1389341 unknown
InChI: InChI=1S/C22H22N2O6/c1-27-17-7-5-13(11-19(17)29-3)9-15-21(25)24-16(22(26)23-15)10-14-6-8-18(28-2)20(12-14)30-4/h5-12,23-24H,1-4H3
charge 0 multiplicity 1
52 atoms
O  -5.718289 -0.068054 -2.348877
O  5.972276 -1.538312 1.213683
O  -7.812924 0.181639 -0.423572
O  8.061375 0.045806 -0.105818
O  0.191803 -0.378829 2.550981
O  0.011329 1.589775 -2.556768
N  -1.082174 0.774659 -0.680976
N  1.280706 0.281873 0.614822
C  -1.167854 0.212685 0.612907
C  1.367868 0.735537 -0.719206
C  -3.7258 -0.060773 0.791959
C  3.927495 0.669513 -1.011145
C  -2.341188 -0.110555 1.260236
C  2.543358 0.940015 -1.408019
C  0.118066 0.014213 1.346604
C  0.079824 1.073351 -1.400411
C  -4.122491 -0.12029 -0.578712
C  4.315513 -0.312612 -0.04999
C  -4.761699 0.005915 1.768019
C  4.965603 1.418434 -1.645553
C  -5.474062 -0.067053 -0.967982
C  5.669322 -0.526367 0.272818
C  -6.492675 0.062789 0.031008
C  6.690805 0.219269 -0.387314
C  -6.11679 0.074214 1.396692
C  6.319147 1.200383 -1.334162
C  -6.756862 -0.974549 -2.884455
C  6.60583 -1.047419 2.461514
C  -8.864115 0.380659 0.580859
C  8.600427 -1.306856 -0.393996
H  -2.183011 -0.425163 2.299462
H  2.39178 1.406726 -2.389237
H  -1.950314 1.048053 -1.152004
H  2.148297 0.17114 1.148246
H  -3.403829 -0.290538 -1.386864
H  3.592889 -0.988504 0.419879
H  -4.493384 0.023844 2.830228
H  4.695599 2.176034 -2.389769
H  -6.879599 0.150084 2.177127
H  7.114564 1.768884 -1.826178
H  -6.692338 -0.854716 -3.976358
H  -7.756638 -0.692914 -2.518155
H  -6.532204 -2.022677 -2.607895
H  7.544193 -0.505798 2.244039
H  6.808268 -1.948363 3.059816
H  5.906924 -0.383996 3.004817
H  -9.79378 0.483452 0.00271
H  -8.683567 1.301453 1.167208
H  -8.940311 -0.489242 1.260957
H  8.032894 -2.084207 0.147257
H  9.646963 -1.280098 -0.055364
H  8.560086 -1.501416 -1.482069
