program: Gaussian 09
title: 000295525
version: EM64L-G09RevD.01
frameworkgroup: C1[X(C22H22O8)]
method: RPBEPBE
basis: SDD
operation: Freq
keyword: #pfreq=noraman
keyword: PBEPBE/SDD
title: #p freq=noraman PBEPBE/SDD
converged: YES YES NO NO
title: Mulliken charges:
elementType: O O O O O O O O C C C C C C C C C C C C C C C C C C C C C C H H H H H H H H H H H H H H H H H H H H H H
charge: -0.271528 -0.271620 -0.267977 -0.267994 -0.380488 -0.380348 -0.225072 -0.224875 0.335905 0.335998 0.266161 0.266914 -0.341273 -0.342027 0.153894 0.153986 -0.469273 -0.469059 0.308318 0.308240 -0.371559 -0.371599 -0.376614 -0.376658 -0.053667 -0.054492 -0.533908 -0.533908 -0.537007 -0.537027 0.263439 0.263769 0.276341 0.276345 0.237505 0.237502 0.240851 0.240860 0.245846 0.220927 0.220265 0.220923 0.220264 0.245864 0.216581 0.245403 0.218578 0.245393 0.216604 0.218565 0.378358 0.378377
chargesum: 0.00000
title: Mulliken charges with hydrogens summed into heavy atoms:
elementType: O O O O O O O O C C C C C C C C C C C C C C C C C C C C C C
charge: -0.271528 -0.271620 -0.267977 -0.267994 -0.002130 -0.001971 -0.225072 -0.224875 0.335905 0.335998 0.266161 0.266914 -0.077833 -0.078258 0.153894 0.153986 -0.192932 -0.192714 0.308318 0.308240 -0.134054 -0.134097 -0.135763 -0.135798 -0.053667 -0.054492 0.153130 0.153143 0.143554 0.143535
polarizability: 5.79929881e+02 1.81245113e+01 2.95057188e+02 2.04386632e-02 -2.07715967e-02 1.78332814e+02
1716.lowfreq: -9.1285 -1.9484 -0.0009 -0.0007 0.0003 2.2854 6.0018 17.0958 23.7978
frequency: 5.9098 17.0825 23.7847 27.5798 45.5232 57.4948 60.4549 70.0185 71.9006 80.6430 89.9697 93.7717 95.2199 123.5583 129.1378 130.4815 134.7499 151.0473 185.0486 194.3033 198.4990 214.9492 228.8886 229.1978 254.9895 255.8720 259.6081 265.0483 285.5824 293.3055 315.0350 315.7440 354.8157 365.5275 380.7132 383.3396 410.8140 457.0324 467.5052 468.8913 499.4895 513.8306 527.1542 553.9811 555.6191 572.4473 573.0565 598.1969 602.7887 615.6486 623.3704 642.5316 678.0952 681.9988 689.5755 689.8852 730.3754 730.8298 746.6433 768.8293 771.5779 791.0669 791.6223 801.6881 861.7072 873.1384 887.9173 896.9951 901.0209 907.8606 915.2371 932.7745 936.3353 989.1031 989.2157 1019.7593 1020.6609 1031.0544 1071.4158 1112.9487 1113.0178 1113.8038 1113.8631 1117.0651 1124.5543 1143.9889 1146.1204 1156.7080 1156.7977 1186.9070 1189.8999 1199.5050 1205.6193 1221.3054 1241.4537 1255.2906 1260.8956 1288.9506 1290.4820 1297.0048 1355.6093 1377.2486 1386.2805 1401.1670 1427.1438 1428.2142 1437.5004 1438.4177 1440.8300 1441.0907 1465.7845 1465.8405 1466.9605 1467.1443 1469.5570 1470.4060 1475.4361 1475.5507 1483.9556 1486.9337 1571.8571 1572.9155 1576.8179 1602.2326 1618.8392 1620.1762 1633.6207 1639.3893 2952.3124 2952.4240 2957.7056 2957.9640 3037.2796 3037.3530 3045.2593 3045.2922 3122.2284 3122.2826 3125.0082 3125.0316 3141.7255 3142.2958 3152.3106 3152.4312 3163.8393 3164.1542 3172.8634 3173.0002 3491.1477 3491.2602
redmass: 4.9114 6.4270 6.7197 5.8694 4.9824 4.9442 8.9116 4.7572 4.5921 3.4656 3.7806 3.7066 3.7957 5.2574 4.6643 7.2659 4.7736 6.3707 3.3582 5.0787 3.8727 4.5004 1.0984 1.1073 1.3874 1.1966 3.4292 7.9038 3.7183 3.6037 4.3170 3.8895 5.3485 6.2379 4.6845 4.4371 4.7443 3.3735 3.9005 3.1955 4.7482 4.6313 4.9367 3.2566 2.9801 3.6992 4.0480 2.4083 2.8641 2.4310 3.5644 2.0506 4.9066 5.0220 5.4287 5.0024 3.6594 3.4194 6.3947 4.8092 5.0509 1.5909 1.5901 5.8630 6.9081 1.4541 1.4944 1.5279 1.4042 1.4443 1.7417 5.5040 5.0291 8.2123 8.0676 3.6550 3.8544 3.6927 2.3851 1.2786 1.2622 1.2644 1.2613 2.4463 2.0604 1.5154 1.5579 1.3452 1.3485 1.8201 2.1372 1.4990 1.7538 3.0555 4.2994 2.2507 1.6994 2.2989 1.6317 1.9519 2.1531 5.6103 4.7330 2.7331 1.7407 1.5933 1.4192 1.2749 1.4776 1.5969 1.0629 1.0557 1.1120 1.0814 1.2056 1.1795 1.0853 1.0826 1.7197 1.9379 6.8087 6.8883 6.5362 6.5382 6.8253 6.6410 8.7518 9.0426 1.0334 1.0334 1.0329 1.0330 1.1036 1.1036 1.1039 1.1039 1.0987 1.0987 1.0992 1.0992 1.0879 1.0880 1.0867 1.0867 1.0919 1.0919 1.0954 1.0954 1.0637 1.0637
irintensity: 0.2399 2.7008 0.1805 2.9268 4.0419 2.5924 1.7534 0.5232 3.0387 3.1805 0.6473 0.1096 0.4491 0.3088 8.7074 0.5143 3.7012 0.8788 0.9763 0.0652 1.4518 2.4617 0.0178 0.0823 0.0410 1.3695 1.2002 2.7146 11.6817 5.7317 2.6857 0.3290 4.6193 0.0355 0.5111 1.2976 8.9655 9.7018 0.2621 0.3570 20.2555 1.8446 23.8081 7.0004 41.0311 0.7117 44.7493 78.9719 5.0219 20.2439 20.8544 105.1012 4.3170 28.8936 10.3670 19.2944 3.3251 2.3464 2.7191 24.9647 4.5139 83.1416 20.9090 0.0684 1.1989 0.1897 7.0633 7.1828 4.4824 13.8518 13.0060 0.0044 24.7148 88.4678 4.8783 94.3390 215.7973 230.7262 125.6373 3.6952 0.3781 2.4828 0.8172 116.2733 0.6748 12.7614 3.0726 0.0022 1.0482 231.9570 88.1253 0.0519 170.8251 44.0672 144.2507 12.1982 12.4683 22.4936 103.0574 9.9544 51.1678 15.6717 155.8515 3.2318 38.0445 135.5136 11.0582 0.7757 68.2113 0.0490 42.6325 11.6631 101.0718 1.8159 126.9574 104.2010 17.3826 0.4502 73.8203 42.1663 1.7062 80.7693 13.9509 10.7014 56.8525 28.2709 194.4199 191.7863 152.8154 23.6446 194.5219 18.0702 46.7405 56.1740 19.8274 73.3162 31.1249 22.2714 16.4518 17.5248 4.6710 18.2917 10.9224 9.6689 1.0359 0.9374 28.9678 11.8536 22.8150 26.6833
temp: 298.150 k
press: 1.00000 atm
elementType: 8 8 8 8 8 8 8 8 6 6 6 6 6 6 6 6 6 6 6 6 6 6 6 6 6 6 6 6 6 6 1 1 1 1 1 1 1 1 1 1 1 1 1 1 1 1 1 1 1 1 1 1
symmnumber: 1
zpe: 1037974.6 jmol-1
zpe.correction: 0.395344 hartree
zpe.thermalcorrener: 0.426023 hartree
zpe.thermalcorrenthalpy: 0.426967 hartree
zpe.thermalcorrgfe: 0.329524 hartree
zpe.sumelectzpe: -1451.061147 hartree
zpe.sumelectthermal: -1451.030467 hartree
zpe.sumelectthermalent: -1451.029523 hartree
zpe.sumelectthermalfe: -1451.126966 hartree
dipole: -0.0034 -0.0065 3.0738
dipole: 3.0738
quadrupole: -86.1728 -150.2178 -180.3874
quadrupole: 8.8065 0.0258 -0.0035
quadrupole: 52.7532 -11.2918 -41.4614 8.8065 0.0258 -0.0035
hfenergy: -1451.4564903 hartree
pointgroup: C01 [X(C22H22O8)]
dipole: 0.0014924 1.2091278 -0.0222058 debye
polarizability: 574.719193|-0.8294713|178.3644903|-42.2498371|1.9634241|300.2361997 unknown
InChI: InChI=1S/C22H22O8/c1-27-15-5-7-19(29-3)13(9-15)11-17(21(23)24)18(22(25)26)12-14-10-16(28-2)6-8-20(14)30-4/h5-12,23,25H,1-4H3
charge 0 multiplicity 1
52 atoms
O  3.244354 1.173926 -2.863493
O  -3.246607 1.264303 2.824176
O  5.719959 -1.318314 1.536582
O  -5.723445 -1.361166 -1.496899
O  1.790598 1.384611 1.915052
O  -1.789503 1.318138 -1.963345
O  0.874084 -0.674383 2.454363
O  -0.878057 -0.760984 -2.429145
C  3.137957 0.066407 -0.732017
C  -3.140568 0.090867 0.728243
C  0.723241 0.172563 0.137677
C  -0.725656 0.167144 -0.143796
C  1.680645 0.168517 -0.856729
C  -1.683275 0.196472 0.849892
C  3.949289 0.565593 -1.809943
C  -3.951793 0.624368 1.789733
C  3.798082 -0.563153 0.35146
C  -3.801107 -0.571535 -0.335276
C  5.205934 -0.672285 0.395817
C  -5.209075 -0.680282 -0.376714
C  5.352991 0.449186 -1.768633
C  -5.355633 0.508672 1.751413
C  5.991093 -0.16478 -0.664906
C  -5.994077 -0.138735 0.667146
C  1.116619 0.200759 1.590505
C  -1.118412 0.144886 -1.596982
C  4.014445 1.650695 -4.011975
C  -4.016475 1.777649 3.956941
C  7.170125 -1.491346 1.611082
C  -7.173991 -1.532838 -1.567428
H  1.332362 0.222411 -1.894136
H  -1.335127 0.285731 1.884858
H  3.229901 -1.030149 1.160807
H  -3.23335 -1.064393 -1.129396
H  5.969217 0.834658 -2.585694
H  -5.971589 0.920757 2.555618
H  7.081868 -0.245671 -0.655961
H  -7.084962 -0.218363 0.660081
H  3.266966 2.051876 -4.711962
H  4.573607 0.825111 -4.49444
H  4.717346 2.454258 -3.717008
H  -4.578117 0.968563 4.463841
H  -4.717105 2.573656 3.637112
H  -3.268529 2.19809 4.645027
H  7.694877 -0.515201 1.619362
H  7.349432 -2.014799 2.561754
H  7.548408 -2.10677 0.770733
H  -7.353681 -2.085562 -2.501308
H  -7.696161 -0.556078 -1.606965
H  -7.554682 -2.120477 -0.708497
H  2.065819 1.343418 2.872722
H  -2.06464 1.243884 -2.91905
