program: Gaussian 09
title: 000295507
version: EM64L-G09RevD.01
frameworkgroup: C1[X(C10H19ClN2O2)]
method: RPBEPBE
basis: SDD
operation: Freq
keyword: #p
keyword: freq=noraman
keyword: PBEPBE/SDD
title: #p freq=noraman PBEPBE/SDD
converged: NO YES NO NO
title: Mulliken charges:
elementType: Cl O O N N C C C C C C C C C C H H H H H H H H H H H H H H H H H H H
charge: -0.091925 -0.455037 -0.320512 -0.432252 -0.403487 0.028287 -0.028003 -0.444953 -0.476955 -0.436112 -0.463589 -0.397197 0.304469 -0.340391 -0.546213 0.222304 0.255170 0.183958 0.244491 0.208079 0.175034 0.196604 0.245179 0.215761 0.207142 0.183298 0.193373 0.284791 0.344008 0.291514 0.266431 0.239862 0.263891 0.282979
chargesum: 0.00000
title: Mulliken charges with hydrogens summed into heavy atoms:
elementType: Cl O O N N C C C C C C C C C C
charge: -0.091925 -0.111029 -0.320512 -0.147461 -0.111973 0.250592 0.227167 -0.016503 -0.093842 0.005672 -0.040686 -0.020526 0.304469 0.165902 0.000657
polarizability: 1.63192407e+02 -2.49655314e-01 1.31975945e+02 3.42778097e+00 -3.28226543e+00 1.11098074e+02
1716.lowfreq: -16.1438 -10.0341 -0.0002 0.0014 0.0017 6.7585 20.5521 24.1112 37.3017
frequency: 16.6062 22.0982 37.2685 59.5715 80.5559 89.6624 106.0880 146.7671 179.4514 191.6130 227.1633 234.7950 265.3793 290.1454 326.8578 351.2037 374.7927 384.5360 419.7913 440.6660 465.6481 488.5143 504.6540 526.8168 592.5291 647.6972 697.5907 714.6804 777.2314 790.5289 820.3224 863.2132 883.7266 920.2440 938.0659 948.8079 961.2679 978.9902 982.9521 1003.4929 1041.4104 1057.4195 1071.5817 1086.2110 1092.0619 1125.9053 1146.3371 1151.1344 1169.3610 1179.0463 1203.6376 1216.9038 1229.5625 1241.2071 1256.3929 1264.9958 1293.5729 1300.2311 1308.7868 1315.9615 1329.9211 1338.7609 1347.4920 1363.1811 1368.4905 1373.6149 1410.0761 1429.9546 1439.2778 1451.5202 1457.3780 1466.4666 1467.6271 1472.6913 1479.3297 1501.9737 1623.2612 2917.0560 2935.9504 2954.6899 2962.8644 2977.1911 2982.6033 2985.4374 2995.6320 3014.2515 3030.5294 3044.7333 3054.0840 3057.9591 3059.2484 3064.2157 3152.9232 3542.1398 3549.6464 3573.3013
redmass: 6.3091 4.5409 6.9949 5.6617 4.4096 3.8350 3.1983 3.7836 4.8746 2.6075 2.1230 4.2729 1.1971 2.0039 1.4508 1.8833 2.7992 2.8556 2.2490 2.4563 2.8550 3.5000 2.4545 1.4341 4.1914 2.7936 3.7991 8.4221 1.5403 2.3884 2.3671 2.3861 2.2466 1.9599 1.6615 2.0730 2.0083 2.7167 3.8753 1.8467 1.9617 2.1665 1.8225 1.4009 1.5606 2.0929 1.7375 1.7899 1.2302 1.6469 1.4321 1.3894 1.2969 1.3790 1.3288 1.3013 1.3453 1.1942 1.3607 1.4568 1.5616 1.3757 1.4778 1.3238 1.4442 1.3800 1.4397 1.1514 1.1024 1.3756 1.1199 1.1193 1.0899 1.0849 1.1419 2.1584 5.1464 1.0549 1.0662 1.0722 1.0920 1.0693 1.0731 1.0759 1.0592 1.0932 1.0858 1.1020 1.0902 1.0951 1.0964 1.0689 1.1118 1.0774 1.0768 1.0666
irintensity: 1.4122 0.6703 0.6022 13.6579 1.3670 10.2777 0.3179 18.8858 1.9470 7.2890 17.5142 1.2822 138.0881 0.1249 9.8955 26.2011 6.9787 3.8622 2.5356 1.8419 12.8396 12.4099 2.2833 201.9938 30.5365 9.2023 6.5820 15.9182 1.1721 1.4055 14.6999 7.9827 10.3400 10.4857 27.8588 16.2873 13.3540 18.1579 47.8889 4.1783 1.9348 2.5665 18.0581 3.3786 1.0091 9.1244 4.4281 2.9840 4.6908 5.9080 8.0721 54.5558 37.5956 146.5076 9.8961 3.5723 23.6144 27.8663 6.2991 30.0942 22.7340 0.7287 0.2957 2.8479 2.8030 2.1482 2.5711 38.3387 14.9635 71.4592 6.3178 15.4361 16.4183 2.1423 41.5766 623.0326 167.6882 52.6648 44.4129 17.8607 22.2523 14.0782 80.8344 27.8678 49.2076 93.3258 36.7611 45.1771 7.1858 23.6879 41.1572 21.7377 16.7462 17.3403 15.6226 2.1013
temp: 298.150 k
press: 1.00000 atm
elementType: 17 8 8 7 7 6 6 6 6 6 6 6 6 6 6 1 1 1 1 1 1 1 1 1 1 1 1 1 1 1 1 1 1 1
symmnumber: 1
zpe: 757709.8 jmol-1
zpe.correction: 0.288596 hartree
zpe.thermalcorrener: 0.305446 hartree
zpe.thermalcorrenthalpy: 0.306390 hartree
zpe.thermalcorrgfe: 0.241090 hartree
zpe.sumelectzpe: -1111.283800 hartree
zpe.sumelectthermal: -1111.266951 hartree
zpe.sumelectthermalent: -1111.266007 hartree
zpe.sumelectthermalfe: -1111.331306 hartree
dipole: 1.6919 -3.4031 0.1858
dipole: 3.8050
quadrupole: -97.0102 -101.8485 -96.2558
quadrupole: -14.2602 5.4778 3.7152
quadrupole: 1.3613 -3.4770 2.1157 -14.2602 5.4778 3.7152
hfenergy: -1111.5723968 hartree
pointgroup: C01 [X(C10H19Cl1N2O2)]
dipole: -0.7397675 1.2725195 0.272875 debye
polarizability: 163.1230874|2.0393752|130.604539|-3.3235431|6.1353767|112.5387994 unknown
InChI: InChI=1S/C10H19ClN2O2/c11-5-6-12-10(15)13-9-3-1-8(7-14)2-4-9/h8-9,12-14H,1-7H2
charge 0 multiplicity 1
34 atoms
Cl 5.295677 1.917545 0.463023
O  -4.993252 0.81833 -1.317841
O  1.910727 -1.81023 -0.467509
N  0.518619 -0.135513 0.387415
N  2.601045 0.428912 -0.557607
C  -3.195257 0.238262 0.201187
C  -0.548194 -1.08118 0.790302
C  -2.318534 -0.355351 -0.929424
C  -2.313358 0.704009 1.38684
C  -1.433514 -1.510075 -0.411583
C  -1.412034 -0.445002 1.906837
C  -4.086272 1.380962 -0.30149
C  1.683637 -0.580496 -0.223934
C  3.887227 0.088975 -1.161128
C  5.058792 0.139188 -0.177551
H  -3.871074 -0.563548 0.568531
H  -0.033359 -1.977893 1.181289
H  -1.675273 0.447782 -1.349732
H  -2.96882 -0.70291 -1.751537
H  -2.946703 1.076052 2.216514
H  -1.692302 1.569472 1.064256
H  -2.078582 -2.350314 -0.081557
H  -0.780274 -1.90097 -1.212071
H  -0.76068 -0.089735 2.728518
H  -2.060167 -1.238936 2.326746
H  -3.456384 2.188043 -0.740111
H  -4.667429 1.808163 0.545708
H  0.331131 0.864898 0.464976
H  -5.588228 1.530671 -1.661129
H  2.485731 1.378785 -0.199966
H  3.79497 -0.951181 -1.528994
H  4.095189 0.748847 -2.02396
H  6.015922 -0.120997 -0.654251
H  4.878123 -0.469264 0.719933
