program: Gaussian 09
title: 000295506
version: EM64L-G09RevD.01
frameworkgroup: C1[X(C10H18Cl2N2O)]
method: RPBEPBE
basis: SDD
operation: Freq
keyword: #p
keyword: freq=noraman
keyword: PBEPBE/SDD
title: #p freq=noraman PBEPBE/SDD
converged: YES YES NO NO
title: Mulliken charges:
elementType: Cl Cl O N N C C C C C C C C C C H H H H H H H H H H H H H H H H H H
charge: -0.077803 -0.090203 -0.318862 -0.437361 -0.403198 0.052806 -0.025098 -0.427915 -0.461270 -0.438960 -0.474385 -0.664276 0.306535 -0.339689 -0.546526 0.232319 0.259179 0.230612 0.192869 0.181588 0.214036 0.198029 0.252519 0.220309 0.211245 0.255627 0.264579 0.285411 0.292377 0.266938 0.241093 0.265169 0.282304
chargesum: 0.00000
title: Mulliken charges with hydrogens summed into heavy atoms:
elementType: Cl Cl O N N C C C C C C C C C C
charge: -0.077803 -0.090203 -0.318862 -0.151950 -0.110822 0.285125 0.234081 -0.004434 -0.065646 0.011588 -0.042830 -0.144070 0.306535 0.168342 0.000948
polarizability: 1.72650731e+02 3.99195713e+00 1.28373720e+02 -1.32506939e+00 -8.56446704e+00 1.20160524e+02
1716.lowfreq: -19.9719 0.0009 0.0009 0.0017 1.8548 9.3952 21.8183 28.2001 38.4160
frequency: 20.8209 26.7553 38.3307 60.4752 79.8282 82.8827 107.1093 132.4706 167.6271 198.0818 228.5425 236.1298 286.9430 311.7365 333.3014 352.3613 383.1455 412.6208 435.2472 464.8013 474.5721 501.6382 530.9278 594.3723 645.1789 678.0901 698.8545 715.1650 779.9029 784.0914 820.0702 862.3158 869.5889 921.4989 932.2631 945.5026 957.1195 980.5828 999.7902 1041.8661 1056.3788 1060.2769 1092.4193 1100.0069 1103.5603 1139.5989 1153.2437 1161.0478 1180.8999 1197.2244 1217.3059 1241.1165 1250.5372 1258.1101 1273.7464 1299.0384 1304.8856 1314.3311 1317.2062 1330.5107 1339.8237 1346.2242 1362.5528 1367.3912 1373.2849 1432.5381 1440.5173 1447.7769 1452.4669 1460.7802 1467.0537 1471.6931 1480.5048 1502.6988 1623.4783 2946.8105 2962.0260 2979.3854 2983.7190 2986.5676 2997.8401 3020.8070 3028.2085 3036.6536 3047.6606 3050.7247 3055.7236 3063.6937 3065.2179 3118.1536 3153.1138 3543.6099 3550.9250
redmass: 9.1267 5.6653 7.6868 5.6313 4.1868 4.6113 3.2320 5.3540 4.8410 2.8688 2.7782 3.9407 2.3150 3.2761 1.5241 1.8914 2.5762 1.9446 2.7125 2.8719 3.4039 2.4134 1.4029 4.1494 3.1481 5.3905 3.8428 8.0156 1.5940 2.1286 2.4010 2.3512 1.8386 1.9994 1.5549 2.0116 2.3889 2.5455 1.9273 1.9486 2.0171 1.8139 1.3624 1.5566 2.0064 1.7692 1.7360 1.5704 1.6898 1.5529 1.3744 1.3805 1.3134 1.2776 1.2578 1.2582 1.3404 1.2605 1.5155 1.4556 1.3456 1.4659 1.3488 1.4453 1.3423 1.1607 1.1020 1.1024 1.4152 1.1233 1.0848 1.0879 1.1516 2.1474 5.1551 1.0658 1.0687 1.0764 1.0663 1.0633 1.0593 1.0937 1.0863 1.0566 1.1022 1.0956 1.0871 1.0977 1.0720 1.1106 1.1118 1.0775 1.0768
irintensity: 0.8335 1.0245 1.1026 12.5341 6.3500 4.0950 1.9070 10.9153 2.6114 1.9865 0.8019 6.3503 2.6599 8.0892 6.2805 24.2675 1.5692 4.9346 1.7392 11.9373 2.4544 8.8017 201.9887 31.2274 29.9676 18.5383 7.6109 16.8995 0.3407 2.4999 11.7136 6.8740 1.5434 6.9221 11.4156 22.3198 26.6925 5.9196 2.5412 0.2783 1.7513 3.8965 3.8638 2.6305 2.1406 5.5149 9.3653 2.1071 6.8034 1.6246 55.0295 168.3241 12.3199 5.0212 5.3351 14.2472 32.9424 34.6963 15.7710 16.8732 1.7591 0.9750 1.8840 2.7337 3.3147 40.5677 15.3357 4.9683 80.2767 9.1180 9.1489 21.7262 45.3784 614.3370 163.3891 28.7931 9.9634 13.3028 51.9279 16.4690 47.0561 50.1654 43.9180 23.7972 31.1704 44.3943 7.5788 27.9590 20.2805 21.3403 16.4541 17.8861 15.2342
temp: 298.150 k
press: 1.00000 atm
elementType: 17 17 8 7 7 6 6 6 6 6 6 6 6 6 6 1 1 1 1 1 1 1 1 1 1 1 1 1 1 1 1 1 1
symmnumber: 1
zpe: 725557.1 jmol-1
zpe.correction: 0.276350 hartree
zpe.thermalcorrener: 0.292927 hartree
zpe.thermalcorrenthalpy: 0.293871 hartree
zpe.thermalcorrgfe: 0.228968 hartree
zpe.sumelectzpe: -1495.546663 hartree
zpe.sumelectthermal: -1495.530086 hartree
zpe.sumelectthermalent: -1495.529142 hartree
zpe.sumelectthermalfe: -1495.594045 hartree
dipole: -0.4707 -1.7016 2.0951
dipole: 2.7398
quadrupole: -122.3616 -110.0150 -103.6934
quadrupole: -1.4191 14.2563 1.1637
quadrupole: -10.3383 2.0083 8.3299 -1.4191 14.2563 1.1637
hfenergy: -1495.8230132 hartree
pointgroup: C01 [X(C10H18Cl2N2O1)]
dipole: 0.1087812 0.7302571 0.7853784 debye
polarizability: 171.9643462|5.409165|129.9015117|3.8074452|8.3072108|119.3191173 unknown
InChI: InChI=1S/C10H18Cl2N2O/c11-5-6-13-10(15)14-9-3-1-8(7-12)2-4-9/h8-9,13-14H,1-7H2
charge 0 multiplicity 1
33 atoms
Cl -5.333727 0.729307 -1.599724
Cl 5.300788 1.955966 0.454801
O  1.926141 -1.791344 -0.503163
N  0.538928 -0.138196 0.396471
N  2.61567 0.449316 -0.548545
C  -3.186394 0.161515 0.178114
C  -0.514237 -1.099915 0.795217
C  -2.284695 -0.414458 -0.941371
C  -2.318263 0.654155 1.372114
C  -1.38266 -1.549869 -0.410711
C  -1.398217 -0.475992 1.901585
C  -4.07913 1.31014 -0.298499
C  1.702491 -0.567195 -0.231796
C  3.897528 0.127066 -1.171886
C  5.079732 0.181577 -0.20163
H  -3.841876 -0.652947 0.552212
H  0.009721 -1.987961 1.194095
H  -2.914421 -0.784093 -1.771117
H  -1.65478 0.400335 -1.35743
H  -1.71383 1.529851 1.048431
H  -2.965526 1.014494 2.195509
H  -2.013949 -2.401383 -0.083375
H  -0.716396 -1.930139 -1.204971
H  -0.76155 -0.100915 2.725874
H  -2.032839 -1.27966 2.322845
H  -3.506281 2.110469 -0.795138
H  -4.697189 1.726385 0.51277
H  0.357733 0.8591 0.51604
H  2.498456 1.394011 -0.177982
H  3.81069 -0.910183 -1.548778
H  4.087955 0.796918 -2.031054
H  6.034256 -0.061353 -0.692281
H  4.91777 -0.438496 0.691474
