program: Gaussian 09
title: 000296418
version: EM64L-G09RevD.01
frameworkgroup: C1[X(C19H26N2O5)]
method: RPBEPBE
basis: SDD
operation: Freq
keyword: #p
keyword: freq=noraman
keyword: PBEPBE/SDD
title: #p freq=noraman PBEPBE/SDD
converged: YES YES NO NO
title: Mulliken charges:
elementType: O O O O O N N C C C C C C C C C C C C C C C C C C C H H H H H H H H H H H H H H H H H H H H H H H H H H
charge: -0.275896 -0.366049 -0.293636 -0.255045 -0.251883 -0.176998 -0.406013 -0.219764 -0.487132 -0.433904 -0.385224 0.213080 -0.169025 -0.039253 0.301023 -0.695423 -0.725536 0.196166 -0.458315 0.492708 -0.500874 -0.413244 -0.385940 -0.225614 -0.230536 -0.232636 0.290551 0.273533 0.230040 0.222234 0.228471 0.267512 0.229906 0.292928 0.404729 0.225408 0.210882 0.234242 0.223987 0.225573 0.222722 0.220327 0.223778 0.258709 0.241370 0.244895 0.239064 0.241875 0.290018 0.227156 0.226583 0.228471
chargesum: 0.00000
title: Mulliken charges with hydrogens summed into heavy atoms:
elementType: O O O O O N N C C C C C C C C C C C C C C C C C C C
charge: -0.275896 -0.366049 -0.293636 -0.255045 -0.251883 -0.176998 -0.001285 0.070787 0.016441 0.016801 0.112194 0.213080 0.123902 0.186155 0.301023 -0.026311 -0.056914 0.196166 0.024172 0.492708 0.224454 -0.171369 -0.095922 0.001542 -0.003953 -0.004165
polarizability: 2.50960159e+02 4.30816290e+00 2.50708533e+02 2.52087304e+00 1.47064081e+01 1.89534370e+02
1716.lowfreq: -5.9315 -2.5599 0.0007 0.0008 0.0008 5.5823 15.4515 21.3571 29.4796
frequency: 15.3331 21.2886 29.3907 30.9768 41.1924 47.2040 52.4680 59.7013 76.0259 81.0614 96.1424 104.0153 111.7434 115.1765 140.2055 162.0713 182.7639 190.1648 202.7035 225.9665 235.3687 236.1537 249.4846 285.4745 292.7364 307.4865 311.9664 332.9838 342.2613 353.6576 391.7806 405.6642 410.7405 452.2473 487.4480 520.0695 572.3824 583.0497 604.1166 609.8704 616.4888 643.0378 677.7239 694.0933 707.5348 710.0376 734.8923 760.0594 786.3331 801.2926 822.6879 825.3306 847.8541 860.7852 865.1402 879.8686 902.5709 910.5134 919.9617 931.1145 942.1047 945.1580 956.0564 969.9040 976.6508 987.8630 987.9526 990.2126 1003.3330 1006.0492 1027.5855 1045.1972 1066.1308 1093.2312 1103.9529 1112.5985 1118.9744 1131.8275 1141.9854 1150.7807 1165.6896 1170.3402 1173.1904 1182.8937 1187.2275 1193.4024 1218.6949 1228.4708 1234.4891 1236.5866 1263.2439 1275.8854 1295.5003 1296.7632 1306.6213 1320.4214 1324.1007 1334.9712 1335.4584 1338.1002 1344.2994 1375.2336 1381.9220 1384.7954 1400.1579 1423.0183 1442.4242 1453.9936 1459.7230 1463.3276 1470.8076 1471.1307 1479.8342 1481.0722 1483.8927 1486.6895 1488.2896 1492.5978 1528.1780 1594.8749 1615.7247 1616.3437 1630.2693 1655.5580 2974.8014 2984.0503 2991.6605 2996.4432 3007.1144 3012.2655 3016.5911 3023.3309 3024.7295 3032.2447 3066.9469 3074.1177 3078.4077 3080.0055 3091.6487 3091.7578 3094.0936 3100.1365 3110.5589 3120.8796 3126.8095 3137.5043 3148.2942 3154.2407 3163.0431 3355.9481
redmass: 4.4681 4.6031 4.9642 4.3778 3.9553 2.6555 4.7351 4.7551 4.9475 7.7289 3.5565 1.3386 3.9274 2.4228 4.2105 4.1737 2.8350 4.2766 1.2549 2.1545 1.8216 2.5162 3.5019 3.6902 4.1628 4.5742 3.6715 3.1198 3.6083 4.7707 2.4234 2.8544 5.0348 3.9405 4.8761 5.0849 3.3801 3.1728 3.6170 3.6340 6.3069 3.5243 8.6510 6.4184 2.7541 2.9196 5.2637 1.9872 2.8580 1.3210 3.2141 3.4514 4.9805 2.2278 1.2477 3.7816 1.6596 3.3388 1.2064 2.8632 1.5015 2.1387 1.8081 1.8892 2.6543 1.7944 2.3500 3.5881 1.7078 2.3100 2.2260 1.9835 1.7312 1.5320 2.2375 1.3241 2.1395 3.2753 3.2000 1.4510 1.9996 2.3620 1.0549 2.1178 1.3823 1.1403 1.5542 1.3951 1.7208 1.6816 1.2877 1.6059 1.3346 1.4392 1.4019 1.4803 1.6031 1.2724 1.4068 1.3724 1.3917 2.8073 1.2121 8.0663 1.2099 1.1938 2.1804 1.0502 1.0471 1.0506 1.0542 1.0891 1.0561 1.1538 1.0834 1.0579 2.1227 1.0926 1.7534 6.0299 5.9560 6.8953 7.2555 10.1212 1.0358 1.0358 1.0681 1.0840 1.0295 1.0613 1.0834 1.0579 1.0644 1.0835 1.0996 1.0994 1.1010 1.0990 1.1003 1.1001 1.1079 1.1022 1.1048 1.0853 1.0881 1.0926 1.0967 1.1050 1.1017 1.0809
irintensity: 0.0214 0.1334 0.1570 0.9161 0.2968 0.0844 0.2968 0.2264 0.5318 7.9612 3.2614 1.9445 1.9184 2.1135 0.1651 1.6294 0.5943 3.0957 0.3097 4.2148 2.6531 1.3294 2.1898 17.3779 43.1355 3.6974 4.0825 0.5861 7.4914 7.9515 2.1310 0.2934 7.0832 5.2729 6.9214 13.9198 5.6852 15.0823 5.8075 9.9562 0.9080 12.9845 11.5752 13.4454 31.0162 24.2816 8.5593 55.8635 41.5165 66.6171 21.2030 14.5835 6.4977 12.5745 0.3456 60.0422 2.2770 69.4932 6.4808 3.4479 2.4562 0.4049 2.7446 11.0798 47.9566 21.8153 24.8032 0.3016 58.1713 91.5020 1.5746 15.3038 24.9387 4.9592 33.9397 0.7311 8.1338 142.7907 32.6254 11.6430 69.1582 89.2623 0.0743 7.4076 6.4823 0.1990 13.6314 31.4543 29.2511 20.0284 34.4250 56.3654 44.1622 101.4462 12.7138 18.4218 12.6623 1.2428 7.4588 27.6324 6.8274 190.3772 18.0736 2.7645 11.7731 22.6120 8.8402 14.5208 9.7649 11.9597 3.2752 6.2809 12.9545 28.5766 17.0617 14.4947 9.9952 8.7363 248.3336 1.2022 12.9478 369.3919 92.4793 352.1156 22.5230 22.1664 39.7988 11.3172 31.5534 33.1736 5.8529 33.3359 23.6969 13.4541 28.7461 9.3123 24.3563 83.2086 7.8786 33.5219 8.9063 20.1448 23.1781 1.7432 5.8122 15.9166 17.7909 15.3706 32.3487 306.3570
temp: 298.150 k
press: 1.00000 atm
elementType: 8 8 8 8 8 7 7 6 6 6 6 6 6 6 6 6 6 6 6 6 6 6 6 6 6 6 1 1 1 1 1 1 1 1 1 1 1 1 1 1 1 1 1 1 1 1 1 1 1 1 1 1
symmnumber: 1
zpe: 1120836.6 jmol-1
zpe.correction: 0.426904 hartree
zpe.thermalcorrener: 0.453935 hartree
zpe.thermalcorrenthalpy: 0.454879 hartree
zpe.thermalcorrgfe: 0.365744 hartree
zpe.sumelectzpe: -1223.309029 hartree
zpe.sumelectthermal: -1223.281997 hartree
zpe.sumelectthermalent: -1223.281053 hartree
zpe.sumelectthermalfe: -1223.370189 hartree
dipole: -0.1575 -2.8703 -0.6816
dipole: 2.9543
quadrupole: -151.6931 -133.0903 -158.9958
quadrupole: -9.0868 12.3273 -1.0064
quadrupole: -3.7667 14.8361 -11.0694 -9.0868 12.3273 -1.0064
hfenergy: -1223.7359326 hartree
pointgroup: C01 [X(C19H26N2O5)]
dipole: 0.3245502 1.0350063 0.4176273 debye
polarizability: 232.7038135|11.9934041|241.1939377|-24.0843713|24.9645604|217.3053116 unknown
InChI: InChI=1S/C19H26N2O5/c1-13(2)16(18(23)25-3)20-17(22)15-10-7-11-21(15)19(24)26-12-14-8-5-4-6-9-14/h4-6,8-9,13,15-16,20H,7,10-12H2,1-3H3
charge 0 multiplicity 1
52 atoms
O  2.96169 -1.944414 -0.164344
O  -1.159429 -0.070698 0.233383
O  -2.633414 -1.477897 -0.966588
O  3.595024 2.96385 -0.372443
O  1.463478 2.604451 0.487402
N  -0.548502 -2.241449 -0.195681
N  1.582922 -0.065676 -0.274128
C  0.633422 -2.111517 0.712827
C  0.993062 -3.578428 1.083217
C  -0.190507 -4.446879 0.574254
C  -0.738554 -3.648585 -0.629088
C  1.842827 -1.378935 0.041336
C  2.591404 0.83188 -0.837025
C  2.489042 1.007635 -2.400634
C  -1.539679 -1.306338 -0.366318
C  2.713438 -0.348579 -3.104399
C  1.1463 1.642824 -2.830089
C  2.46089 2.193373 -0.152762
C  -2.169143 1.044217 0.194516
C  -2.451377 1.510871 1.603211
C  3.570663 4.337891 0.191296
C  -3.632627 1.104942 2.273154
C  -1.526411 2.356076 2.270656
C  -3.890448 1.53637 3.594145
C  -1.783658 2.784733 3.591381
C  -2.965702 2.377951 4.255234
H  0.32977 -1.513569 1.592074
H  1.937749 -3.838643 0.574788
H  1.155703 -3.687855 2.167884
H  -0.974846 -4.53636 1.34776
H  0.13162 -5.462926 0.290295
H  -1.803422 -3.823181 -0.848718
H  -0.150513 -3.848393 -1.545871
H  3.587603 0.405947 -0.6152
H  0.648041 0.305788 -0.039736
H  3.314473 1.694526 -2.67582
H  2.736866 -0.208694 -4.200788
H  3.659469 -0.820343 -2.786821
H  1.894721 -1.051707 -2.8673
H  0.29498 0.999527 -2.53728
H  0.99087 2.643274 -2.385133
H  1.114725 1.755353 -3.9288
H  -1.69212 1.833311 -0.41184
H  -3.064441 0.658342 -0.32167
H  2.714102 4.901911 -0.214169
H  3.49146 4.293839 1.290175
H  4.525186 4.783337 -0.120219
H  -4.346999 0.450514 1.758741
H  -0.606147 2.661596 1.758317
H  -4.807737 1.22128 4.104034
H  -1.065986 3.43617 4.102807
H  -3.165039 2.71549 5.278775
