program: Gaussian 09
title: 000295515
version: EM64L-G09RevD.01
frameworkgroup: C1[X(C17H25ClN2O2)]
method: RPBEPBE
basis: SDD
operation: Freq
keyword: #p
keyword: freq=noraman
keyword: PBEPBE/SDD
title: #p freq=noraman PBEPBE/SDD
converged: YES YES NO NO
title: Mulliken charges:
elementType: Cl O O N N C C C C C C C C C C C C C C C C C H H H H H H H H H H H H H H H H H H H H H H H H H
charge: -0.082915 -0.417412 -0.232141 -0.083890 -0.175470 -0.365350 -0.356708 -0.405769 -0.389272 -0.353022 -0.440370 -0.339021 0.493327 -0.363490 -0.331950 -0.399038 -0.489283 -0.302751 -0.419306 0.507277 0.172420 -0.801174 0.211789 0.185291 0.211062 0.190429 0.217665 0.212177 0.216201 0.205822 0.203070 0.190958 0.205409 0.207720 0.219464 0.182311 0.210753 0.213337 0.261566 0.219900 0.253227 0.252144 0.228375 0.241643 0.218019 0.241640 0.375334
chargesum: 0.00000
title: Mulliken charges with hydrogens summed into heavy atoms:
elementType: Cl O O N N C C C C C C C C C C C C C C C C C
charge: -0.082915 -0.042078 -0.232141 -0.083890 -0.175470 0.031730 0.044783 0.024073 0.032752 0.041005 -0.027241 0.062753 0.493327 0.060600 -0.070384 -0.179139 0.016088 -0.302751 -0.190930 0.507277 0.172420 -0.099872
polarizability: 2.98106022e+02 -3.15657988e+01 1.66915635e+02 -8.75657310e+00 -2.04444310e+00 1.98224208e+02
1716.lowfreq: -13.6108 -6.2916 0.0023 0.0024 0.0025 3.2988 10.5332 12.5431 15.0148
frequency: 8.5162 12.3009 14.4710 33.8628 47.9932 55.1837 72.2213 84.9899 100.5144 110.2037 116.2561 123.1536 156.6787 183.6415 187.5794 229.8733 233.1099 241.3148 253.7505 279.3121 287.5199 311.1778 338.9599 360.5514 395.5620 418.9013 442.4084 445.5193 471.4482 484.6325 487.2323 501.1056 542.3474 576.1654 591.7967 605.0346 639.5798 671.1131 694.1570 708.4536 722.8607 737.5966 789.7602 800.9630 814.9078 832.5703 843.6190 847.9305 876.2653 905.5751 935.1109 937.5860 952.0578 979.0858 990.8296 1009.9725 1016.9637 1032.6999 1043.8858 1051.8697 1062.9538 1066.3687 1074.5401 1086.5792 1098.2508 1107.3375 1124.1281 1141.5239 1157.7081 1164.3869 1196.3726 1208.6695 1219.7216 1235.9688 1237.0491 1241.0187 1248.9814 1268.8191 1278.9092 1279.6827 1287.8874 1290.3147 1301.0256 1323.7048 1337.0977 1344.4905 1352.4304 1360.6586 1362.8893 1370.0658 1371.4614 1379.8062 1394.8100 1400.1791 1415.4705 1436.8613 1454.1731 1455.9174 1460.4696 1461.7784 1465.2103 1467.7001 1470.1098 1472.7892 1477.2536 1487.4539 1505.7209 1550.2047 1628.7344 1668.6843 2838.0902 2846.5272 2859.9990 2910.9640 2922.1955 2962.5477 2973.9295 2979.5597 2985.3180 2993.1932 3000.4337 3013.3251 3025.8113 3031.1377 3038.6282 3049.5039 3054.2265 3057.6662 3061.2046 3087.5654 3089.7048 3125.2599 3162.1089 3185.9200 3512.4705
redmass: 8.1955 7.3611 7.0900 4.2634 3.1405 2.9920 3.2551 2.5485 3.8926 2.0700 1.3644 2.5573 3.9828 3.4004 5.0760 2.5297 2.7979 4.3360 2.5151 2.3943 4.0870 4.1896 3.6727 3.0488 2.1069 5.0469 3.1165 3.9186 2.8237 3.5652 4.0646 1.8005 3.0895 3.3448 4.1367 3.0571 1.3094 4.9204 2.6609 4.3917 1.2864 1.7266 1.5711 1.5414 3.7988 1.6305 3.1025 1.5817 1.8776 1.9352 2.0741 1.7624 2.4895 1.8391 1.4873 3.3670 2.8043 2.3052 1.4866 1.7478 2.4869 2.5026 2.0267 2.2746 2.1629 2.4477 1.5497 2.6992 1.7232 2.0141 1.4795 1.3486 1.4390 2.0134 1.6253 1.4276 1.4564 1.3475 1.3450 1.1093 1.1794 1.3473 1.3873 1.4961 1.6499 1.4104 2.0192 1.6055 1.6288 1.8437 1.5787 1.8358 1.4188 1.2437 3.8936 1.0844 1.0833 1.0856 1.0944 1.0457 1.1010 1.0703 1.0888 1.1296 1.1061 1.0974 3.1052 5.3798 7.3334 8.2187 1.0710 1.0716 1.0694 1.0689 1.0709 1.0632 1.0610 1.0366 1.0614 1.0600 1.0899 1.0929 1.0988 1.0892 1.1005 1.0886 1.0906 1.0975 1.1028 1.0994 1.0891 1.0886 1.0936 1.0907 1.0639
irintensity: 0.3616 0.9208 0.7315 0.2313 0.4148 0.0319 0.1842 0.5608 1.3871 2.1808 0.7595 0.4510 0.2379 0.5468 1.5683 7.4709 1.5330 4.2681 1.1474 2.8765 2.2155 1.7722 14.2630 4.5259 2.7735 4.6996 8.7301 9.8084 0.4654 9.2843 5.5167 26.9352 9.8951 4.5542 11.2206 6.7523 128.2919 3.8885 6.8314 27.5281 12.2867 15.9777 5.8225 14.0449 14.8591 22.4464 1.5096 9.1686 6.1263 3.0905 37.2141 17.1266 39.6746 23.9217 20.3010 156.8270 50.4579 60.7273 7.6972 4.3534 5.6441 63.8047 20.5581 13.4289 4.5925 12.4634 2.2314 76.8312 5.0922 17.9124 7.8441 15.4895 43.0757 33.0379 51.2393 29.6349 32.4375 13.6043 9.3223 1.8535 0.2750 22.5483 17.9755 27.3378 11.0961 7.0348 17.1823 9.2021 8.2534 39.9670 5.5304 53.1870 0.1224 14.4065 3.3735 30.1531 6.9839 3.2843 43.9933 12.4058 28.7645 15.4513 1.5963 9.6090 7.7388 25.2605 228.7855 50.6625 186.2887 209.6701 42.0484 48.6663 187.0221 54.3660 106.7732 7.4452 35.6863 41.9685 9.2140 39.8815 10.5449 13.7808 8.2779 46.4373 31.7030 47.2034 22.5650 18.0819 93.1561 17.1062 21.8053 18.2507 20.2622 3.9345 18.3463
temp: 298.150 k
press: 1.00000 atm
elementType: 17 8 8 7 7 6 6 6 6 6 6 6 6 6 6 6 6 6 6 6 6 6 1 1 1 1 1 1 1 1 1 1 1 1 1 1 1 1 1 1 1 1 1 1 1 1 1
symmnumber: 1
zpe: 1032750.0 jmol-1
zpe.correction: 0.393354 hartree
zpe.thermalcorrener: 0.416676 hartree
zpe.thermalcorrenthalpy: 0.417621 hartree
zpe.thermalcorrgfe: 0.335074 hartree
zpe.sumelectzpe: -1381.121509 hartree
zpe.sumelectthermal: -1381.098186 hartree
zpe.sumelectthermalent: -1381.097242 hartree
zpe.sumelectthermalfe: -1381.179789 hartree
dipole: -1.7599 0.9708 0.4676
dipole: 2.0636
quadrupole: -162.5388 -135.7287 -137.1196
quadrupole: 2.0312 18.1290 -4.7728
quadrupole: -17.4098 9.4003 8.0095 2.0312 18.1290 -4.7728
hfenergy: -1381.5148627 hartree
pointgroup: C01[X(C17H25Cl1N2O2)]
dipole: -0.6701628 -0.3090385 -0.3384087 debye
polarizability: 294.5610254|30.5493316|174.4795194|24.1402897|-10.4485126|194.2053207 unknown
InChI: InChI=1S/C17H25ClN2O2/c1-14-6-7-15(13-16(14)18)20-11-9-19(10-12-20)8-4-2-3-5-17(21)22/h6-7,13,21H,2-5,8-12H2,1H3
charge 0 multiplicity 1
47 atoms
Cl 6.113977 0.360562 2.598051
O  -7.469088 2.168352 1.775547
O  -7.657054 1.3692 -0.395502
N  -0.91859 -1.588416 -0.219988
N  1.75478 -0.454086 -0.203394
C  0.223114 -2.321963 0.374779
C  -0.434333 -0.7690 -1.355593
C  1.311152 -1.3569 0.876976
C  0.627785 0.233669 -0.876795
C  -2.031056 -2.503805 -0.5857
C  -3.349116 -1.777004 -0.928499
C  -3.878264 -0.888242 0.21788
C  3.011965 0.188506 -0.10601
C  -5.207231 -0.189915 -0.140642
C  3.843459 0.027527 1.043492
C  3.521447 0.996126 -1.168704
C  -5.723655 0.696304 1.008817
C  5.112413 0.629093 1.079824
C  4.792915 1.59074 -1.080253
C  5.645783 1.427744 0.044933
C  -7.02104 1.407676 0.680267
C  7.016307 2.068418 0.109866
H  -0.143062 -2.91843 1.231006
H  0.683967 -3.027458 -0.364309
H  -1.279965 -0.204477 -1.786183
H  0.000568 -1.411368 -2.164514
H  2.169365 -1.960608 1.219579
H  0.91799 -0.781972 1.747511
H  0.146748 0.953468 -0.175484
H  0.997201 0.802909 -1.74331
H  -2.20847 -3.164201 0.286218
H  -1.743013 -3.167839 -1.442318
H  -3.227401 -1.166205 -1.845884
H  -4.103803 -2.550099 -1.179057
H  -3.104365 -0.139817 0.477087
H  -4.016317 -1.513788 1.124947
H  -5.976506 -0.944478 -0.39555
H  -5.076302 0.42934 -1.049105
H  3.505591 -0.535526 1.915076
H  2.939966 1.140058 -2.083751
H  -4.975827 1.466908 1.282481
H  -5.885155 0.10258 1.929937
H  5.153153 2.196767 -1.920287
H  7.811573 1.311648 0.241765
H  7.226456 2.632028 -0.815085
H  7.097813 2.765467 0.964518
H  -8.318577 2.625305 1.52756
