program: Gaussian 09
title: 000295472
version: EM64L-G09RevD.01
frameworkgroup: C1[X(C12H15F3N2O)]
method: RPBEPBE
basis: SDD
operation: Freq
keyword: #p
keyword: freq=noraman
keyword: PBEPBE/SDD
title: #p freq=noraman PBEPBE/SDD
converged: YES YES NO NO
title: Mulliken charges:
elementType: F F F O N N C C C C C C C C C C C C H H H H H H H H H H H H H H H
charge: -0.149767 -0.193409 -0.169812 -0.292949 -0.433079 -0.504384 -0.019307 -0.348825 -0.691547 -0.680667 0.287935 0.392544 0.084622 -0.320701 -0.335243 0.236462 -0.216624 -0.248265 0.247077 0.202053 0.183954 0.283613 0.218696 0.197900 0.235221 0.220331 0.214995 0.221633 0.325079 0.318173 0.261831 0.234163 0.238299
chargesum: 0.00000
title: Mulliken charges with hydrogens summed into heavy atoms:
elementType: F F F O N N C C C C C C C C C C C C
charge: -0.149767 -0.193409 -0.169812 -0.292949 -0.149465 -0.179305 0.227770 0.037182 -0.039730 -0.023708 0.287935 0.392544 0.084622 -0.002528 -0.073412 0.236462 0.017538 -0.009966
polarizability: 2.16140077e+02 -1.79946014e+01 1.54683410e+02 -7.85331783e+00 2.91923298e+00 9.65145122e+01
1716.lowfreq: -11.7883 -4.5475 -0.0008 0.0002 0.0004 1.5898 7.8646 30.0217 42.4233
frequency: -3.8664 30.0039 42.3892 55.7728 72.8249 81.1339 97.2615 114.5900 160.8282 190.8680 206.9217 207.9539 220.4359 245.7881 275.1899 307.6507 329.1562 332.7819 369.8324 403.3097 411.0561 425.7148 444.3894 493.0127 516.2848 522.6523 562.7323 590.8604 604.1425 607.7020 691.7027 704.6062 735.9143 753.0042 770.0371 772.7436 817.6498 851.2174 892.6206 914.7270 929.6230 965.5569 970.4388 973.3249 989.9479 1005.5824 1015.5645 1027.2688 1052.1178 1058.9730 1116.8145 1133.4531 1150.3829 1171.0019 1180.6715 1213.9908 1245.8086 1262.2876 1281.5343 1298.8383 1315.1774 1342.8564 1344.5741 1378.2975 1385.5454 1393.7798 1444.4132 1457.7099 1466.7651 1472.4360 1474.0910 1475.9390 1484.2400 1493.2808 1528.3651 1590.0313 1622.8802 1661.2436 2960.6867 2975.5546 2984.3004 3020.2863 3039.6104 3072.3386 3080.6190 3083.0168 3092.0181 3141.3661 3159.9366 3179.0916 3193.9214 3518.4362 3528.7159
redmass: 3.5367 4.4314 7.2901 8.5195 4.5051 3.2737 2.0705 5.0636 4.9523 2.0843 2.0589 1.5048 1.8289 3.5051 5.5244 5.6727 4.0580 4.3299 1.9165 9.1299 2.5517 6.2318 2.6541 2.9584 3.8606 7.2226 4.1963 6.3750 6.7057 1.4445 7.8141 10.5863 5.2019 4.1248 1.2475 1.5859 2.2315 2.6906 1.4121 2.2369 5.7334 1.5804 1.3666 4.4023 1.9846 1.3113 3.0098 4.6254 2.5077 2.6569 2.4433 1.8676 2.0937 2.2330 1.0722 1.9903 2.2801 1.3436 2.3224 1.2613 1.9860 1.5062 1.3337 7.6625 1.2168 1.2168 2.5695 1.1489 1.2220 1.0511 1.3286 1.4027 1.0598 1.5899 2.3530 5.3637 6.1431 3.1013 1.0629 1.0377 1.0362 1.0941 1.0888 1.0972 1.0997 1.0999 1.1001 1.0876 1.0910 1.0980 1.0955 1.0771 1.0764
irintensity: 0.3535 0.1548 3.7717 6.8214 2.6221 2.7985 1.0825 0.0252 5.2842 0.7809 0.6085 0.5932 0.3670 7.5533 0.9046 8.8436 1.7086 4.9615 12.0898 2.6726 8.1866 1.4926 1.9922 3.2406 31.1241 9.3771 7.9311 4.9860 14.4297 81.9758 8.2238 11.7237 0.6780 2.3159 129.0071 10.0238 2.1098 3.5731 6.8706 3.6459 223.8003 26.9712 30.3124 103.5396 34.6278 2.7679 54.0234 81.0586 1.7923 8.4821 11.9437 17.5010 1.7600 72.5188 11.9336 303.5215 200.3413 136.1077 142.2223 13.4766 92.1503 21.4333 40.4388 58.0244 16.9467 14.9232 29.5253 123.5206 231.1591 7.5198 30.1626 87.1542 21.0049 181.0765 279.4244 162.3283 97.8149 146.7230 38.2719 39.0848 22.4264 16.9344 4.9831 27.4270 45.6593 59.6640 40.5122 7.3319 7.5795 8.3454 17.7038 19.0015 44.4162
temp: 298.150 k
press: 1.00000 atm
elementType: 9 9 9 8 7 7 6 6 6 6 6 6 6 6 6 6 6 6 1 1 1 1 1 1 1 1 1 1 1 1 1 1 1
symmnumber: 1
zpe: 671297.4 jmol-1
zpe.correction: 0.255684 hartree
zpe.thermalcorrener: 0.273322 hartree
zpe.thermalcorrenthalpy: 0.274266 hartree
zpe.thermalcorrgfe: 0.209222 hartree
zpe.sumelectzpe: -949.213357 hartree
zpe.sumelectthermal: -949.195719 hartree
zpe.sumelectthermalent: -949.194775 hartree
zpe.sumelectthermalfe: -949.259819 hartree
dipole: 1.4127 -0.4300 -0.4765
dipole: 1.5517
quadrupole: -90.1535 -108.1666 -109.8552
quadrupole: -14.4879 -1.6949 1.2485
quadrupole: 12.5716 -5.4415 -7.1301 -14.4879 -1.6949 1.2485
hfenergy: -949.4690411 hartree
pointgroup: C01 [X(C12H15F3N2O1)]
dipole: -0.5568169 -0.0874903 0.2344641 debye
polarizability: 216.7117162|12.6148119|146.6623594|-14.3549847|-19.1550842|103.9639237 unknown
InChI: InChI=1S/C12H15F3N2O/c1-3-8(2)16-11(18)17-10-7-5-4-6-9(10)12(13,14)15/h4-8,16-17H,3H2,1-2H3
charge 0 multiplicity 1
33 atoms
F  3.446142 -2.266258 0.676465
F  1.467767 -1.845497 1.712119
F  1.495614 -2.469347 -0.459753
O  -1.620751 1.789584 -0.352079
N  -2.455274 -0.204467 0.539923
N  -0.145579 0.044128 0.296246
C  -3.876394 0.205308 0.487474
C  -4.680893 -0.699104 -0.484004
C  -4.486234 0.213339 1.907164
C  -4.184861 -0.632231 -1.942809
C  -1.425594 0.631181 0.123889
C  1.105575 0.590535 -0.05725
C  2.288476 -0.214963 0.069189
C  1.2484 1.924704 -0.531502
C  3.56006 0.320033 -0.249322
C  2.202673 -1.648223 0.47916
C  2.52119 2.433207 -0.850363
C  3.686533 1.644128 -0.706095
H  -3.860513 1.235351 0.087248
H  -5.743106 -0.38817 -0.434019
H  -4.647704 -1.746746 -0.116155
H  -2.254141 -1.149158 0.876413
H  -5.527846 0.580877 1.87666
H  -4.501815 -0.804607 2.343053
H  -3.906258 0.87002 2.578538
H  -3.124253 -0.932978 -2.017732
H  -4.775258 -1.300969 -2.595051
H  -4.266423 0.395284 -2.341567
H  -0.122285 -0.860876 0.771269
H  0.349632 2.533373 -0.640865
H  4.444622 -0.313807 -0.140261
H  2.601434 3.464444 -1.211469
H  4.672565 2.050307 -0.949611
