program: Gaussian 09
title: 000022662
version: EM64L-G09RevD.01
frameworkgroup: C1[X(C12H17NO2)]
method: RPBEPBE
basis: SDD
operation: Freq
keyword: #p
keyword: freq=noraman
keyword: PBEPBE/SDD
title: #p freq=noraman PBEPBE/SDD
converged: YES YES NO NO
title: Mulliken charges:
elementType: O O N C C C C C C C C C C C C H H H H H H H H H H H H H H H H H
charge: -0.282733 -0.289781 -0.312268 0.326187 -0.496757 0.303379 -0.434709 -0.519309 -0.542766 -0.521605 0.246870 0.167726 -0.234735 -0.689406 -0.523925 0.232547 0.203249 0.214822 0.188363 0.192549 0.233087 0.267091 0.246406 0.252258 0.203693 0.211482 0.208200 0.235413 0.225548 0.206853 0.226340 0.255932
chargesum: 0.00000
title: Mulliken charges with hydrogens summed into heavy atoms:
elementType: O O N C C C C C C C C C C C C
charge: -0.282733 -0.289781 -0.045177 0.326187 -0.060961 0.303379 -0.031524 -0.093673 -0.296360 -0.269347 0.246870 0.167726 0.180440 -0.020245 0.165200
polarizability: 1.98253378e+02 2.28209048e+00 1.53396999e+02 1.44398011e+00 -2.37701107e+00 8.81383796e+01
1716.lowfreq: -0.0001 0.0007 0.0007 4.7955 6.2456 9.4176 49.0329 63.9822 87.5808
frequency: 49.0128 63.9236 87.5781 106.7403 109.9181 113.6419 153.0097 187.2948 213.6546 240.8264 244.8539 291.1265 298.9738 308.8645 321.3137 384.4096 413.6471 441.3230 473.3872 499.4926 539.8929 590.2822 635.8021 644.7444 718.5511 724.7873 738.4388 776.6465 823.6710 853.1435 876.6079 883.3157 901.3849 932.0005 953.2308 991.8280 998.8101 1036.3652 1065.9053 1099.4136 1111.8944 1114.8981 1136.5046 1151.0156 1155.6475 1182.1691 1185.8251 1198.1260 1200.9191 1250.3412 1253.6447 1261.9922 1277.8346 1295.8195 1322.4744 1364.5573 1375.8268 1387.6510 1398.8147 1402.1287 1435.4468 1440.3785 1447.6193 1455.2519 1460.7841 1466.6830 1477.4884 1478.3937 1483.5002 1489.2041 1506.4874 1585.4308 1618.8776 2821.5372 2856.4542 2952.2927 2967.7528 2973.3545 2995.4327 3007.0710 3010.0883 3027.7418 3042.4666 3074.9233 3092.6994 3104.0701 3120.6064 3135.4293 3138.8993 3473.4312
redmass: 3.1851 2.8356 2.3075 3.0505 2.0010 2.7712 1.3842 2.5545 3.3081 1.2765 3.5778 3.2820 3.0526 3.9917 2.7151 3.8890 3.5308 3.1384 3.6795 3.1214 2.9760 3.5788 3.7901 3.7589 3.0377 3.6561 2.8278 3.6271 1.1836 1.4151 2.5575 1.5739 2.5394 2.5875 3.6981 1.8671 2.6278 2.7353 1.9962 3.3233 1.2593 2.1185 1.4366 1.7456 1.9845 1.2655 1.7031 2.9229 1.2730 1.2090 1.4258 1.1535 3.6358 1.3720 1.6205 1.4660 2.2467 2.2735 1.4194 2.2720 1.4026 1.1175 1.3128 1.0609 1.0404 1.1065 1.0796 1.1101 1.0627 1.1538 2.4856 7.9335 7.0435 1.0717 1.0714 1.0555 1.0354 1.0593 1.0361 1.0858 1.1071 1.1001 1.0904 1.0965 1.0989 1.1013 1.1041 1.0906 1.0906 1.0754
irintensity: 1.4320 4.2088 1.9404 4.6290 1.1142 1.0963 1.5951 2.5510 0.7477 0.8102 4.3398 4.2050 1.9957 0.5085 6.0489 1.1832 16.5821 24.9743 6.9072 19.6198 50.5824 22.4020 15.2487 22.7049 12.4700 1.4021 25.7726 11.4175 10.5428 2.5874 7.1165 32.3992 1.8192 48.4536 28.3739 4.2561 15.6878 48.9004 3.5574 117.5124 6.1115 7.6974 4.2649 0.6342 10.9032 28.2447 18.8170 81.4345 5.4564 2.1130 19.5388 1.8947 188.6414 8.8770 28.4101 8.3912 15.9680 16.1493 22.2388 15.2774 8.8840 7.0052 3.1523 11.7194 11.9993 12.2287 34.2978 3.9614 8.4652 55.5582 121.8396 0.5890 14.4326 97.1036 130.2065 40.2999 95.0662 32.5282 25.6008 32.0847 35.6948 32.6478 62.2057 38.3225 30.5005 34.5177 21.1267 18.3023 4.5593 1.1601
temp: 298.150 k
press: 1.00000 atm
elementType: 8 8 7 6 6 6 6 6 6 6 6 6 6 6 6 1 1 1 1 1 1 1 1 1 1 1 1 1 1 1 1 1
symmnumber: 1
zpe: 705531.7 jmol-1
zpe.correction: 0.268723 hartree
zpe.thermalcorrener: 0.283825 hartree
zpe.thermalcorrenthalpy: 0.284769 hartree
zpe.thermalcorrgfe: 0.226598 hartree
zpe.sumelectzpe: -671.490548 hartree
zpe.sumelectthermal: -671.475447 hartree
zpe.sumelectthermalent: -671.474502 hartree
zpe.sumelectthermalfe: -671.532673 hartree
dipole: -0.0790 -2.1186 2.2401
dipole: 3.0843
quadrupole: -73.9558 -82.5881 -93.8375
quadrupole: -5.8928 -0.1642 2.4641
quadrupole: 9.5046 0.8724 -10.3770 -5.8928 -0.1642 2.4641
hfenergy: -671.7592712 hartree
pointgroup: C01 [X(C12H17N1O2)]
dipole: 0.0549066 -0.8002819 -0.9104762 debye
polarizability: 198.0203697|-2.7816146|153.1619496|4.8889937|4.7048859|88.6064374 unknown
InChI: InChI=1S/C12H17NO2/c1-3-15-12-6-9-4-5-13-8-10(9)7-11(12)14-2/h6-7,13H,3-5,8H2,1-2H3
charge 0 multiplicity 1
32 atoms
O  -2.507554 -0.358174 -0.180543
O  -1.723515 2.351259 0.220756
N  3.973357 0.007128 0.326246
C  1.265363 -0.655979 -0.1554
C  2.344726 -1.728709 -0.252371
C  1.610415 0.704433 0.03992
C  3.715497 -1.114242 -0.600304
C  3.066674 1.153383 0.119891
C  -0.103083 -1.017487 -0.2448
C  0.578359 1.66979 0.119284
C  -1.131912 -0.055593 -0.141195
C  -0.781569 1.31965 0.031557
C  -2.89257 -1.779862 -0.254479
C  -4.418146 -1.829154 -0.218439
C  -2.764563 2.513168 -0.813182
H  2.434914 -2.250267 0.720903
H  2.064907 -2.487359 -1.009641
H  4.51309 -1.868851 -0.475666
H  3.714574 -0.796373 -1.674201
H  3.301506 1.726223 -0.816162
H  3.189436 1.85871 0.964031
H  4.960133 0.287291 0.36079
H  -0.353027 -2.074344 -0.388014
H  0.811554 2.730862 0.266026
H  -2.498656 -2.223906 -1.192486
H  -2.450941 -2.324208 0.6056
H  -4.763977 -2.878192 -0.258048
H  -4.799236 -1.368934 0.709004
H  -4.848376 -1.287583 -1.078491
H  -2.30203 2.709503 -1.800871
H  -3.347351 3.391234 -0.494234
H  -3.408898 1.620383 -0.87048
