program: Gaussian 09
title: 000295479
version: EM64L-G09RevD.01
frameworkgroup: C1[X(C14H21ClN2O)]
method: RPBEPBE
basis: SDD
operation: Freq
keyword: #p
keyword: freq=noraman
keyword: PBEPBE/SDD
title: #p freq=noraman PBEPBE/SDD
converged: YES YES NO NO
title: Mulliken charges:
elementType: Cl O N N C C C C C C C C C C C C C C H H H H H H H H H H H H H H H H H H H H H
charge: -0.085506 -0.291001 -0.417485 -0.504159 -0.369448 -0.356817 -0.343939 -0.396717 -0.354287 -0.692698 0.284934 0.346342 0.310033 -0.357373 -0.250701 -0.827544 -0.216235 -0.268977 0.185151 0.184423 0.226664 0.198394 0.187549 0.193318 0.259336 0.209287 0.193627 0.192196 0.285633 0.210504 0.211550 0.215972 0.313223 0.312378 0.230556 0.227710 0.267143 0.231291 0.255673
chargesum: 0.00000
title: Mulliken charges with hydrogens summed into heavy atoms:
elementType: Cl O N N C C C C C C C C C C C C C C
charge: -0.085506 -0.291001 -0.131852 -0.190935 0.000126 0.068241 0.036928 0.071906 0.031537 -0.054673 0.284934 0.346342 0.310033 -0.044996 -0.250701 -0.102135 0.015056 -0.013304
polarizability: 2.48409408e+02 2.14721018e+01 1.68204717e+02 2.35108120e+01 -2.36050566e+01 1.39543577e+02
1716.lowfreq: -11.8988 -7.6743 -1.9443 -0.0009 0.0003 0.0007 9.9408 18.4736 37.7175
frequency: 3.3581 17.1683 37.4217 42.1259 53.9445 74.4693 92.2696 110.7771 120.4937 130.4406 146.7670 189.0185 197.7594 207.9074 227.4197 244.8215 273.2505 282.5128 302.0179 330.7340 352.6797 368.3290 376.1830 416.6885 475.5194 498.6330 511.1613 546.7581 552.1049 585.1373 635.6162 703.3575 708.0438 715.4802 724.9719 750.1556 787.1362 790.5607 820.2931 838.3450 881.1431 885.4160 908.3598 918.6541 964.0698 988.0204 995.4232 1009.3329 1030.8157 1038.3221 1064.0103 1070.2986 1079.7828 1105.1920 1120.5537 1134.0927 1148.6296 1196.9796 1200.3645 1205.3957 1216.0645 1233.7288 1256.3099 1280.2918 1285.1896 1290.2046 1299.1183 1315.6346 1348.6265 1352.6759 1356.9724 1369.8111 1390.6244 1394.6485 1432.1385 1438.7997 1447.4591 1455.4092 1462.7601 1468.8747 1474.0872 1477.2960 1478.5261 1483.7825 1487.2272 1491.8188 1513.3901 1577.1591 1615.8119 1649.0341 2943.6644 2955.8833 2956.5275 2966.3915 2973.1271 2976.2472 2984.9900 2991.9443 3001.8253 3024.4031 3028.8745 3046.3701 3069.5725 3072.1814 3078.6326 3110.9152 3145.5957 3178.4443 3196.0931 3540.6923 3554.1448
redmass: 4.1053 5.2719 1.8036 3.8519 4.6024 4.2086 4.1443 2.5385 2.2401 2.4939 3.0543 1.1324 4.5249 3.4616 1.1238 4.2381 4.7544 3.0998 3.2311 2.5973 1.5893 5.4642 4.4216 2.8917 3.8785 3.3884 2.6393 4.0910 2.0956 1.9845 5.6037 6.1322 3.1225 2.7279 1.1526 1.3118 1.4812 4.2188 1.5416 3.6793 1.7602 2.1252 1.3547 2.2502 1.6225 1.3059 1.6016 2.5406 2.7701 1.4827 2.3728 2.1155 2.3582 3.1040 2.5812 1.8507 1.6646 1.5846 1.5395 1.8435 1.8233 1.4515 1.2622 1.2375 1.0652 1.1691 2.2786 1.2984 1.5083 1.7220 3.0990 1.4665 1.2168 1.2804 2.4973 1.9449 1.2129 1.0869 1.0748 1.0743 1.3531 1.0423 1.0900 1.6907 1.0913 1.0461 2.0561 5.3322 6.4635 4.2137 1.0584 1.0411 1.0589 1.0594 1.0364 1.0631 1.0949 1.0669 1.1004 1.0982 1.1034 1.1012 1.1006 1.0994 1.0989 1.0926 1.0887 1.0953 1.0955 1.0759 1.0768
irintensity: 0.7251 0.0940 0.0549 2.6813 9.5793 3.2502 0.6829 0.4841 0.0500 0.4791 3.6973 0.6612 1.3601 1.2727 0.0207 0.6304 4.6690 3.6980 1.8045 4.1724 32.4479 22.4764 4.9646 6.1005 0.2646 1.1667 0.9484 12.3775 76.1381 98.2001 17.5061 15.0702 11.1616 6.5740 7.9128 1.6941 69.6884 1.4344 4.6076 14.6459 6.0861 5.3482 4.1160 3.0221 0.8774 4.5847 45.0983 44.2404 8.9480 3.3744 7.6412 9.1088 1.6949 5.4479 3.7946 4.6365 9.9943 18.1587 8.3972 208.5267 40.2445 94.9652 4.4716 59.6567 1.0444 32.9450 46.9839 25.8999 13.5833 9.6640 58.5440 13.3013 12.1817 19.4996 100.4802 34.3262 28.0817 3.7631 5.2677 0.8198 278.2578 13.8820 9.7859 236.5272 23.2052 18.2819 357.3117 183.6749 38.2207 145.9107 15.1903 30.4487 2.9034 70.5755 33.9061 57.9016 14.0805 42.4915 0.4807 22.0201 20.1268 110.0415 90.2980 51.9117 7.7540 3.8184 10.6672 3.4506 11.8800 14.4046 19.5797
temp: 298.150 k
press: 1.00000 atm
elementType: 17 8 7 7 6 6 6 6 6 6 6 6 6 6 6 6 6 6 1 1 1 1 1 1 1 1 1 1 1 1 1 1 1 1 1 1 1 1 1
symmnumber: 1
zpe: 857283.9 jmol-1
zpe.correction: 0.326522 hartree
zpe.thermalcorrener: 0.346832 hartree
zpe.thermalcorrenthalpy: 0.347776 hartree
zpe.thermalcorrgfe: 0.272628 hartree
zpe.sumelectzpe: -1189.525508 hartree
zpe.sumelectthermal: -1189.505198 hartree
zpe.sumelectthermalent: -1189.504254 hartree
zpe.sumelectthermalfe: -1189.579402 hartree
dipole: -3.6098 1.8859 -2.4740
dipole: 4.7652
quadrupole: -119.8634 -123.2589 -111.9089
quadrupole: -3.3522 5.9351 -2.7191
quadrupole: -1.5197 -4.9152 6.4348 -3.3522 5.9351 -2.7191
hfenergy: -1189.8520298 hartree
pointgroup: C01 [X(C14H21Cl1N2O1)]
dipole: 1.4804251 -0.5963934 -0.9836171 debye
polarizability: 247.2494266|26.4030872|166.886434|-19.935064|25.2176828|142.0218413 unknown
InChI: InChI=1S/C14H21ClN2O/c1-3-4-5-6-10-16-14(18)17-13-9-7-8-12(15)11(13)2/h7-9,16-17H,3-6,10H2,1-2H3
charge 0 multiplicity 1
39 atoms
Cl -5.477286 -2.31501 -0.489788
O  -0.052313 2.222708 0.422212
N  1.235421 1.058064 -1.137809
N  -0.939292 0.317728 -0.679769
C  4.129594 0.079832 -0.399015
C  3.447663 1.393599 0.044265
C  5.183402 -0.423733 0.61307
C  2.405274 1.936787 -0.961097
C  5.880726 -1.731709 0.173768
C  6.928637 -2.226701 1.193917
C  0.069117 1.265959 -0.400089
C  -2.224848 0.207698 -0.086501
C  -3.061904 -0.864312 -0.552526
C  -2.675514 1.101109 0.920844
C  -4.337043 -0.9736 0.04434
C  -2.569763 -1.811571 -1.631218
C  -3.959357 0.934305 1.475525
C  -4.811174 -0.106079 1.046267
H  4.614443 0.230252 -1.387427
H  3.362604 -0.711363 -0.538921
H  2.952082 1.251839 1.024182
H  4.221251 2.175477 0.189396
H  5.949503 0.364936 0.766601
H  4.69847 -0.580326 1.598956
H  2.017658 2.906498 -0.605107
H  2.876306 2.095022 -1.951042
H  6.367174 -1.572218 -0.810443
H  5.11461 -2.519053 0.018114
H  1.338862 0.23168 -1.727668
H  7.721363 -1.470082 1.346442
H  6.46184 -2.424734 2.177214
H  7.413694 -3.160846 0.856001
H  -0.735297 -0.369187 -1.406746
H  -2.015874 1.90687 1.245623
H  -2.350965 -1.27614 -2.577381
H  -1.653148 -2.350377 -1.31611
H  -3.328374 -2.574017 -1.861491
H  -4.303382 1.625234 2.252378
H  -5.808862 -0.240941 1.47123
