program: Gaussian 09
title: 000295467
version: EM64L-G09RevD.01
frameworkgroup: C1[X(C14H11Cl2NO2)]
method: RPBEPBE
basis: SDD
operation: Freq
keyword: #p
keyword: freq=noraman
keyword: PBEPBE/SDD
title: #p freq=noraman PBEPBE/SDD
converged: NO YES NO NO
title: Mulliken charges:
elementType: Cl Cl O O N C C C C C C C C C C C C C C H H H H H H H H H H H
charge: -0.061186 -0.055443 -0.344793 -0.253352 -0.458292 0.269575 0.330211 -0.203106 -0.352414 -0.777553 -0.219501 -0.260433 0.390572 0.238019 -0.292557 -0.392929 -0.191339 -0.179491 -0.119752 0.301780 0.264427 0.264497 0.198589 0.323789 0.236648 0.259878 0.308140 0.258916 0.257631 0.259469
chargesum: 0.00000
title: Mulliken charges with hydrogens summed into heavy atoms:
elementType: Cl Cl O O N C C C C C C C C C C C C C C
charge: -0.061186 -0.055443 -0.344793 -0.253352 -0.134503 0.269575 0.330211 -0.203106 -0.050635 -0.050040 0.017147 -0.000555 0.390572 0.238019 0.015583 -0.134012 0.066293 0.079977 -0.119752
polarizability: 3.37283316e+02 -1.84850279e+00 1.84372619e+02 4.81200765e-03 4.04765421e-01 7.31136423e+01
1716.lowfreq: -123.9364 -8.1348 -1.5950 0.0015 0.0016 0.0017 5.8894 9.4447 21.7036
frequency: -123.9302 8.1965 21.6715 48.6132 51.8026 62.9354 121.2668 140.3929 147.6630 184.7014 210.7235 235.8209 275.7649 292.8280 318.9951 325.5150 359.3304 376.2061 397.3955 412.7838 481.5860 496.0429 502.4656 524.4436 557.8004 599.0386 615.7453 640.4709 679.8447 688.1163 698.3520 716.1222 717.7045 775.2123 790.0939 809.5284 817.6442 834.9517 863.6414 908.8755 946.6564 958.9338 967.9622 984.6442 994.9157 1004.7689 1033.3405 1070.0326 1076.0484 1106.7908 1132.0883 1151.1673 1164.1638 1192.5279 1206.1366 1214.9311 1287.1668 1295.2790 1362.5294 1369.7877 1398.8339 1410.0551 1427.8743 1448.6082 1457.7442 1465.9921 1479.6146 1513.6928 1584.3964 1586.3824 1600.6395 1609.2541 1685.8823 2992.3742 3071.5695 3086.9565 3151.0975 3161.3176 3168.3175 3180.3819 3181.1417 3196.1858 3211.8054 3563.4913
redmass: 1.0535 4.2325 9.6508 8.5066 9.7000 6.6766 5.2773 10.3335 6.6063 8.8038 4.2335 8.4200 6.9079 4.1482 6.6477 7.4736 5.0763 7.7770 10.6274 3.0283 3.9379 2.8394 3.4105 6.3466 4.2732 7.3753 7.2493 1.7329 8.0047 3.6397 3.6158 9.0754 2.5098 5.4141 1.4658 5.7767 1.3022 1.4400 5.2970 1.3582 1.3382 4.3464 1.3256 1.3138 4.0776 2.0132 1.4833 2.4729 2.1664 1.3182 3.1409 2.2189 1.4594 1.6701 2.0197 1.8780 1.2519 2.1215 6.8104 7.3807 3.5959 1.3608 2.3977 2.0721 1.0422 2.3074 1.3756 2.0976 6.9637 4.3066 6.4887 6.9520 8.8541 1.0378 1.0979 1.0974 1.0886 1.0887 1.0917 1.0952 1.0977 1.0957 1.0945 1.0749
irintensity: 1.3819 0.0189 0.1448 4.3923 0.1657 0.6014 0.7342 2.3905 0.2706 2.8586 0.3673 1.9205 5.5013 9.2460 0.6773 2.9884 2.7866 12.7010 18.3833 0.0936 0.2462 20.1432 0.0528 0.8836 3.1855 0.2646 2.4986 27.7408 48.7544 53.1021 22.3504 27.0614 0.5361 2.1891 70.2439 9.3210 13.7025 80.2357 48.5830 3.2784 1.6690 192.2117 1.5552 2.9294 102.3645 20.2902 6.7642 117.4994 14.1232 23.4055 284.0207 548.6492 29.5876 169.9223 185.6533 3.1577 10.4090 13.9947 59.6304 5.0803 22.1224 47.5472 333.7019 5.8670 14.4157 384.8022 3.1454 310.1797 46.2969 232.2698 10.1534 18.8401 228.7847 19.9296 8.6351 38.8319 7.9750 3.4585 2.0233 2.7275 2.0538 8.2326 6.9946 48.8287
temp: 298.150 k
press: 1.00000 atm
elementType: 17 17 8 8 7 6 6 6 6 6 6 6 6 6 6 6 6 6 6 1 1 1 1 1 1 1 1 1 1 1
symmnumber: 1
zpe: 567411.3 jmol-1
zpe.correction: 0.216116 hartree
zpe.thermalcorrener: 0.233008 hartree
zpe.thermalcorrenthalpy: 0.233953 hartree
zpe.thermalcorrgfe: 0.167552 hartree
zpe.sumelectzpe: -1664.084456 hartree
zpe.sumelectthermal: -1664.067564 hartree
zpe.sumelectthermalent: -1664.066619 hartree
zpe.sumelectthermalfe: -1664.133020 hartree
dipole: 1.2997 -1.6981 0.0033
dipole: 2.1384
quadrupole: -143.0954 -111.3536 -128.8157
quadrupole: 5.0941 -0.0123 0.1640
quadrupole: -15.3404 16.4013 -1.0608 5.0941 -0.0123 0.1640
hfenergy: -1664.3005719 hartree
pointgroup: C01 [X(C14H11Cl2N1O2)]
dipole: -0.4966154 0.522827 0.4333582 debye
polarizability: 337.1294928|-4.0915241|139.7133983|-3.1907022|54.6323618|117.9266858 unknown
InChI: InChI=1S/C14H11Cl2NO2/c1-9-12(16)3-2-4-13(9)17-14(18)19-11-7-5-10(15)6-8-11/h2-8,17H,1H3
charge 0 multiplicity 1
30 atoms
Cl -6.191588 1.019801 0.814866
Cl 7.176187 -0.017352 -0.036325
O  1.179986 0.508139 0.373773
O  0.339922 -1.212444 -1.046892
N  -1.033444 0.277996 0.187927
C  -3.448966 0.587857 0.450323
C  -2.35697 -0.124877 -0.1479
C  -4.746702 0.154902 0.087874
C  -2.589259 -1.198992 -1.04785
C  -3.28119 1.743821 1.421265
C  -3.906993 -1.578363 -1.365372
C  -5.009889 -0.903315 -0.799164
C  2.575947 0.289697 0.198991
C  0.160364 -0.258932 -0.257885
C  3.15932 -0.721403 -0.600598
C  3.375887 1.203444 0.923167
C  4.569285 -0.806106 -0.66597
C  4.780917 1.114655 0.854143
C  5.35937 0.106116 0.057068
H  -1.737827 -1.721799 -1.486084
H  -3.777439 2.651832 1.034235
H  -3.760114 1.510833 2.389342
H  -2.233212 2.01309 1.634178
H  -0.924659 1.058854 0.835481
H  -4.077838 -2.406992 -2.059972
H  -6.038152 -1.186981 -1.036653
H  2.535279 -1.421822 -1.155692
H  2.892253 1.972548 1.531969
H  5.039517 -1.580429 -1.278683
H  5.409704 1.816123 1.409236
