program: Gaussian 09
title: 000295462
version: EM64L-G09RevD.01
frameworkgroup: C1[X(C10H14N2O2)]
method: RPBEPBE
basis: SDD
operation: Freq
keyword: #p
keyword: freq=noraman
keyword: PBEPBE/SDD
title: #p freq=noraman PBEPBE/SDD
converged: YES YES NO NO
title: Mulliken charges:
elementType: O O N N C C C C C C C C C C H H H H H H H H H H H H H H
charge: -0.456779 -0.417330 -0.001961 -0.014036 0.252811 0.230727 0.091483 0.123256 -0.718782 -0.750081 -0.723357 -0.723240 -0.234348 -0.192147 0.229565 0.239685 0.229629 0.225109 0.253551 0.220143 0.229002 0.239476 0.241616 0.226433 0.240791 0.235623 0.364482 0.358679
chargesum: 0.00000
title: Mulliken charges with hydrogens summed into heavy atoms:
elementType: O O N N C C C C C C C C C C
charge: -0.092296 -0.058651 -0.001961 -0.014036 0.252811 0.230727 0.091483 0.123256 -0.019902 -0.051279 -0.013263 -0.020392 -0.234348 -0.192147
polarizability: 1.30604046e+02 -1.23700082e+00 1.09840245e+02 4.84647901e-01 -1.35983341e-01 1.13847929e+02
1716.lowfreq: -13.6052 -2.7080 -0.0005 0.0003 0.0004 12.8448 56.6058 108.6067 114.5781
frequency: 56.2387 108.5942 114.5684 142.3064 146.4756 149.9717 155.5981 190.1027 213.4490 222.7719 254.0059 265.8234 287.4134 305.2522 311.8452 340.1087 355.5331 358.1065 379.5907 403.7390 408.0948 449.0535 472.0303 476.3834 491.2051 561.4123 591.6237 626.8122 656.9689 672.5070 813.3742 875.6021 940.9082 944.3578 950.5413 959.3155 971.5558 977.6569 995.0752 1022.9294 1041.3478 1091.7744 1144.9284 1170.8854 1183.4625 1187.9061 1220.5128 1237.1828 1283.3615 1345.4271 1381.2248 1389.2652 1401.7715 1413.6599 1448.8447 1457.6915 1462.0310 1470.3791 1474.6848 1486.8784 1489.8939 1498.7975 2177.7233 2199.7927 2987.9472 2995.4732 2997.8474 3000.3508 3078.3963 3085.5278 3086.7574 3092.2364 3101.8739 3104.7560 3112.7197 3116.9048 3526.9719 3548.6843
redmass: 6.1765 7.0308 5.3838 1.3901 1.6808 2.3234 2.5058 1.4300 1.3849 1.3455 2.2133 3.5845 4.3576 3.3739 2.6641 2.1010 2.6379 1.4765 3.1578 2.3516 2.4410 10.3714 2.2818 6.2477 4.2006 3.4205 7.8578 7.6183 2.6518 3.2580 4.4302 5.1348 2.9339 1.4036 1.5625 1.7455 2.3527 1.9278 1.3060 6.7129 2.1285 4.3756 2.0847 3.6444 2.4514 2.4693 3.5757 2.6399 1.6726 1.9327 1.1961 1.2128 1.1860 1.1851 1.0497 1.0497 1.0457 1.0506 1.0471 1.0615 1.0511 1.0558 12.6673 12.6477 1.0383 1.0372 1.0373 1.0374 1.0980 1.0989 1.1002 1.0991 1.0985 1.0992 1.0983 1.0952 1.0656 1.0660
irintensity: 5.8204 7.4965 0.0861 2.1703 0.4355 2.8111 0.4943 0.2419 0.4773 2.6585 2.8420 0.6468 8.5982 7.7965 5.2834 22.1680 6.2570 39.5440 29.7501 77.2007 68.1939 0.2573 75.8850 1.9400 31.8814 1.2635 3.8755 3.1267 0.9700 0.7195 9.2546 13.1055 47.8877 8.4752 8.2225 5.6362 18.8961 25.2238 0.2914 128.0320 13.4752 9.4564 2.0389 7.0175 25.8689 15.2758 18.5437 8.1081 39.3373 27.0905 6.1052 30.5895 32.5549 9.4286 8.0485 16.2345 4.4462 15.6185 2.7957 4.3253 14.0405 27.0222 6.4432 3.9859 15.7222 11.2116 17.5213 10.8780 3.9781 19.9269 2.6265 29.9408 10.6689 34.6722 19.4495 6.3281 16.0093 15.5503
temp: 298.150 k
press: 1.00000 atm
elementType: 8 8 7 7 6 6 6 6 6 6 6 6 6 6 1 1 1 1 1 1 1 1 1 1 1 1 1 1
symmnumber: 1
zpe: 580875.4 jmol-1
zpe.correction: 0.221244 hartree
zpe.thermalcorrener: 0.237223 hartree
zpe.thermalcorrenthalpy: 0.238167 hartree
zpe.thermalcorrgfe: 0.180333 hartree
zpe.sumelectzpe: -648.274249 hartree
zpe.sumelectthermal: -648.258270 hartree
zpe.sumelectthermalent: -648.257326 hartree
zpe.sumelectthermalfe: -648.315159 hartree
dipole: 2.3073 -0.9012 2.6499
dipole: 3.6274
quadrupole: -110.1059 -75.8283 -85.8501
quadrupole: -3.3251 4.6782 -2.5907
quadrupole: -19.5111 14.7664 4.7447 -3.3251 4.6782 -2.5907
hfenergy: -648.4954926 hartree
pointgroup: C01 [X(C10H14N2O2)]
dipole: 0.8756132 -0.3983938 1.0541555 debye
polarizability: 130.5448702|-1.4151631|109.8767128|0.902197|-0.3192698|113.8706364 unknown
InChI: InChI=1S/C10H14N2O2/c1-7(2)9(13,5-11)8(3,4)10(7,14)6-12/h13-14H,1-4H3
charge 0 multiplicity 1
28 atoms
O  1.507823 0.067983 1.669237
O  -1.684552 -0.036745 1.576766
N  3.244482 -0.010747 -1.328656
N  -3.124676 -0.034317 -1.493025
C  0.016385 -1.147423 -0.001708
C  -0.002389 1.126159 0.022122
C  1.103876 0.001971 0.255577
C  -1.104868 -0.022478 0.237097
C  0.042415 -1.741027 -1.4244
C  0.016095 -2.292553 1.024981
C  -0.035364 2.264994 1.056875
C  0.01314 1.733308 -1.395694
C  2.287229 0.004877 -0.615048
C  -2.238824 -0.028664 -0.695067
H  0.947371 -2.361161 -1.557212
H  -0.841762 -2.385824 -1.573535
H  0.038151 -0.984524 -2.224328
H  0.02097 -1.94465 2.070359
H  -0.889715 -2.908912 0.890674
H  0.895038 -2.946237 0.8683
H  0.748069 3.00699 0.821974
H  -1.017265 2.76885 1.014223
H  0.140727 1.924373 2.088308
H  -0.016099 0.987362 -2.205115
H  -0.863147 2.393471 -1.521854
H  0.925104 2.341399 -1.531992
H  2.122337 -0.684022 1.872404
H  -0.940349 0.071048 2.225837
