program: Gaussian 09
title: 000295477
version: EM64L-G09RevD.01
frameworkgroup: C1[X(C12H13ClN6O2)]
method: RPBEPBE
basis: SDD
operation: Freq
keyword: #p
keyword: freq=noraman
keyword: PBEPBE/SDD
title: #p freq=noraman PBEPBE/SDD
converged: YES YES NO NO
title: Mulliken charges:
elementType: Cl O O N N N N N N C C C C C C C C C C C C H H H H H H H H H H H H H
charge: -0.076325 -0.248605 -0.158512 -0.395738 -0.172170 -0.064328 -0.123214 -0.586362 -0.582486 0.339133 0.263859 -0.473315 -0.367735 -0.320049 -0.786303 -0.104013 -0.245994 0.199431 0.124123 0.064730 0.075688 0.221236 0.274315 0.259898 0.236792 0.237160 0.251518 0.215138 0.252234 0.335140 0.336961 0.334608 0.335107 0.348077
chargesum: 0.00000
title: Mulliken charges with hydrogens summed into heavy atoms:
elementType: Cl O O N N N N N N C C C C C C C C C C C C
charge: -0.076325 -0.248605 -0.158512 -0.060598 -0.172170 -0.064328 -0.123214 0.085207 0.100698 0.339133 0.263859 0.022236 -0.107837 -0.083257 -0.082487 -0.104013 0.006240 0.199431 0.124123 0.064730 0.075688
polarizability: 2.67559008e+02 -9.22282068e-01 1.68910047e+02 2.83175191e+01 -5.73972126e+00 1.57824492e+02
1716.lowfreq: -4.3529 -0.0006 0.0003 0.0012 3.5292 6.0905 9.8669 19.1328 27.0817
frequency: 9.5053 19.0591 27.0580 62.3634 64.4713 80.2369 116.8556 126.7183 169.8602 178.0575 187.3569 192.7509 209.5770 227.2284 240.8759 251.4550 288.7650 322.4232 341.2833 362.2948 379.1437 441.0682 474.3820 485.0192 488.7652 513.4176 532.9071 541.4974 546.4815 548.5609 552.5893 567.0224 593.1296 620.3226 672.2280 689.1898 710.5424 712.8962 720.4133 732.2726 737.6370 793.7751 802.1984 855.3656 874.8300 888.7223 895.4197 919.5926 927.9941 992.2035 997.2783 1021.7248 1032.7105 1047.9354 1077.9116 1090.1984 1129.9580 1131.6962 1166.0647 1183.5498 1225.9600 1253.6145 1266.8836 1268.2761 1330.0469 1352.1956 1380.2061 1394.1778 1402.7425 1425.3076 1452.3715 1457.1117 1467.8868 1473.0175 1481.7756 1493.7402 1524.7688 1555.6006 1591.0438 1600.9543 1603.2652 1635.2303 1674.2264 2949.8353 2985.9319 3057.2819 3065.6757 3095.4850 3152.6611 3157.6560 3175.8827 3499.8498 3550.8003 3557.0258 3711.1583 3716.0793
redmass: 7.1973 7.5788 4.1095 7.1860 8.6222 6.8683 3.2508 1.2853 5.3628 7.5852 6.4728 3.1634 4.4787 5.2405 4.8792 4.0637 5.4452 3.4290 5.9349 8.6871 4.3307 2.9139 3.1033 1.2066 3.9714 1.2104 4.8405 1.1498 3.2124 3.0252 7.6192 1.0622 6.8303 7.4230 1.6503 6.2623 3.3934 11.2869 5.4864 3.0089 4.3251 1.4659 10.3759 6.0695 1.3471 6.2369 11.9336 1.3539 2.5062 1.9504 1.6805 4.0958 4.7401 1.5183 3.2106 1.9479 2.4464 1.9859 2.4229 2.1530 1.9287 1.5951 2.9800 1.5970 1.3457 3.5771 6.2442 3.0405 1.3045 5.6686 1.0898 1.0459 2.8090 1.5795 1.9083 3.4074 1.9817 2.8553 6.7792 1.5116 7.4414 2.2881 8.1964 1.0657 1.0365 1.0945 1.0968 1.1005 1.0880 1.0925 1.0968 1.0756 1.0444 1.0445 1.1060 1.1058
irintensity: 0.2816 0.0368 0.5650 0.0608 3.5941 1.7505 2.4581 1.8955 1.3152 0.2127 6.0768 1.7609 7.0845 13.6958 5.0118 5.9590 4.3064 1.4393 4.0553 4.9440 0.3220 5.4155 2.0178 167.7484 8.5288 362.0278 19.3192 36.7263 3.6690 2.4863 4.9822 8.4743 5.2014 43.3368 57.6329 11.9957 1.2834 0.0296 1.7474 11.2997 17.0090 51.7741 62.6330 36.6013 17.2786 15.5451 6.9954 0.5656 2.6908 1.5338 11.0788 52.2927 36.9703 7.3321 71.4871 19.2912 0.4842 117.7564 223.0528 77.9820 29.7182 69.1054 1.7851 13.1703 7.6665 27.4999 9.4527 22.9841 22.4941 480.2612 17.0775 10.3930 875.4268 465.6290 182.3542 234.0550 38.8515 354.5714 0.7455 728.6108 5.8761 139.5865 143.3890 51.0155 25.3897 14.1846 14.0450 21.8890 15.9227 2.9659 4.9499 27.6835 129.3210 104.2208 53.6385 51.5111
temp: 298.150 k
press: 1.00000 atm
elementType: 17 8 8 7 7 7 7 7 7 6 6 6 6 6 6 6 6 6 6 6 6 1 1 1 1 1 1 1 1 1 1 1 1 1
symmnumber: 1
zpe: 661251.0 jmol-1
zpe.correction: 0.251857 hartree
zpe.thermalcorrener: 0.271831 hartree
zpe.thermalcorrenthalpy: 0.272775 hartree
zpe.thermalcorrgfe: 0.200005 hartree
zpe.sumelectzpe: -1402.608623 hartree
zpe.sumelectthermal: -1402.588650 hartree
zpe.sumelectthermalent: -1402.587705 hartree
zpe.sumelectthermalfe: -1402.660475 hartree
dipole: -5.8370 1.4401 -2.5833
dipole: 6.5435
quadrupole: -111.9323 -124.6086 -117.0756
quadrupole: 13.6782 7.4910 -7.2740
quadrupole: 5.9399 -6.7364 0.7966 13.6782 7.4910 -7.2740
hfenergy: -1402.8604802 hartree
pointgroup: C01 [X(C12H13Cl1N6O2)]
dipole: -2.1453026 -1.1433193 -0.8474445 debye
polarizability: 259.8475018|38.236112|163.1247072|10.223387|6.4776448|171.3213376 unknown
InChI: InChI=1S/C12H13ClN6O2/c1-6-4-7(13)2-3-8(6)21-5-9(20)16-12-18-10(14)17-11(15)19-12/h2-4,16H,5,14-15H2,1H3
charge 0 multiplicity 1
34 atoms
Cl 5.794931 -0.142438 3.029264
O  1.948086 0.444554 -1.575669
O  -0.27728 1.31852 -0.073372
N  -1.517317 -0.598199 -0.723593
N  -3.618566 -1.503095 -0.386539
N  -3.027217 0.595197 0.704117
N  -5.248619 -0.383858 1.049285
N  -5.753557 -2.400691 -0.028937
N  -4.611877 1.631191 2.067574
C  3.976178 1.042598 -0.475042
C  2.779562 0.268639 -0.447285
C  0.714889 -0.305688 -1.653214
C  4.882891 0.89973 0.598523
C  2.494669 -0.607914 0.62307
C  4.24564 1.990203 -1.624089
C  4.595765 0.015074 1.657577
C  3.412961 -0.739522 1.690559
C  -0.393878 0.251984 -0.711846
C  -2.768956 -0.465874 -0.092518
C  -4.850304 -1.401834 0.219537
C  -4.296951 0.580896 1.251825
H  0.884143 -1.386661 -1.457387
H  0.383094 -0.189681 -2.700441
H  5.809642 1.481611 0.604361
H  1.561103 -1.176362 0.665994
H  4.283521 1.448399 -2.587024
H  3.432922 2.733164 -1.716861
H  5.200075 2.524494 -1.482504
H  3.198401 -1.409825 2.527418
H  -1.472878 -1.453331 -1.288492
H  -6.672042 -2.355385 0.404722
H  -5.489931 -3.169373 -0.639497
H  -5.531627 1.673623 2.498565
H  -3.911274 2.352255 2.224814
