program: Gaussian 09
title: 000295439
version: EM64L-G09RevD.01
frameworkgroup: C1[X(C9H7Cl3N2O3)]
method: RPBEPBE
basis: SDD
operation: Freq
keyword: #p
keyword: freq=noraman
keyword: PBEPBE/SDD
title: #p freq=noraman PBEPBE/SDD
converged: YES YES NO YES
title: Mulliken charges:
elementType: Cl Cl Cl O O O N N C C C C C C C C C H H H H H H H
charge: 0.088178 0.088309 0.180567 -0.178859 -0.205397 -0.193192 -0.431707 0.020205 0.381182 0.264413 -0.479832 -0.349493 0.407384 -0.395754 -0.837576 0.435522 -0.783094 0.353101 0.245809 0.358278 0.291050 0.242924 0.255058 0.242923
chargesum: 0.00000
title: Mulliken charges with hydrogens summed into heavy atoms:
elementType: Cl Cl Cl O O O N N C C C C C C C C C
charge: 0.088178 0.088309 0.180567 -0.178859 -0.205397 -0.193192 -0.073430 0.020205 0.381182 0.264413 -0.126732 -0.103683 0.407384 -0.104704 -0.096671 0.435522 -0.783094
polarizability: 2.15634715e+02 1.79317713e+00 1.81133006e+02 3.36527224e-03 3.65989120e-03 9.01472866e+01
1716.lowfreq: -16.0424 -0.4126 -0.0020 -0.0019 0.0006 5.0286 7.4403 36.6698 44.1571
frequency: -15.9858 36.6683 44.1278 68.0241 70.0611 104.5681 127.9195 161.7872 184.5567 198.7491 225.0873 228.8007 255.4326 268.9202 302.3113 324.1054 336.8861 354.7385 385.8648 416.0869 449.2083 529.0131 542.8860 551.2127 567.9255 620.7642 643.4763 707.0688 707.6101 730.4184 747.5226 755.2237 763.2261 819.5124 840.9623 927.4891 943.4921 964.3997 978.0580 996.1494 1045.3762 1077.3218 1135.2603 1166.9442 1190.3385 1215.7091 1270.3347 1275.1168 1371.8761 1390.5358 1402.5456 1426.8999 1463.3952 1483.6131 1487.4719 1529.4035 1600.7407 1618.3357 1648.2672 2964.2380 3035.9376 3098.2399 3147.4950 3191.4318 3198.7195 3515.2677
redmass: 11.4945 15.4595 10.0935 5.8862 11.2697 4.1674 16.0223 10.3299 11.3347 1.0906 9.6515 5.5929 7.3002 11.6945 9.8529 3.8388 15.7428 7.8666 16.2808 5.1491 3.0410 5.5220 3.4529 6.9891 3.8829 7.1359 2.0640 7.6028 5.5689 3.2092 10.6911 9.4688 8.4390 7.2389 1.3488 5.6936 5.8113 1.4056 1.3505 1.6348 1.5501 2.0739 1.8308 2.8153 2.4558 10.5900 2.3776 1.5176 9.0856 4.7767 1.3286 3.7853 1.9991 1.0427 1.5000 1.8400 5.7050 6.1255 7.9021 1.0403 1.0978 1.0955 1.0908 1.0950 1.0928 1.0760
irintensity: 2.8509 0.3055 1.8642 1.3620 0.8400 0.7740 0.9246 0.5597 0.3668 0.9712 5.4932 0.4293 1.0728 0.2433 4.3679 6.0876 2.2662 0.7515 6.3257 4.5877 9.4975 1.1926 3.6039 39.5967 42.0018 2.4343 98.5633 39.2413 50.1767 3.3255 71.5491 61.0820 45.8017 62.2062 28.0922 11.1239 17.4319 33.8619 2.9322 10.5449 7.7094 33.0939 6.3099 18.7809 53.8858 245.4924 58.5917 5.1798 98.5974 26.6245 13.3476 112.1532 71.8134 17.9795 87.2540 264.9011 67.3975 14.1732 139.8199 14.3344 11.9786 12.8756 11.9103 2.9245 18.8270 36.4385
temp: 298.150 k
press: 1.00000 atm
elementType: 17 17 17 8 8 8 7 7 6 6 6 6 6 6 6 6 6 1 1 1 1 1 1 1
symmnumber: 1
zpe: 399738.9 jmol-1
zpe.correction: 0.152253 hartree
zpe.thermalcorrener: 0.168187 hartree
zpe.thermalcorrenthalpy: 0.169132 hartree
zpe.thermalcorrgfe: 0.107201 hartree
zpe.sumelectzpe: -2061.191543 hartree
zpe.sumelectthermal: -2061.175608 hartree
zpe.sumelectthermalent: -2061.174664 hartree
zpe.sumelectthermalfe: -2061.236595 hartree
dipole: -2.1328 7.4722 0.0000
dipole: 7.7706
quadrupole: -138.6646 -117.3390 -118.8503
quadrupole: 16.2918 0.0043 -0.0005
quadrupole: -13.7133 7.6123 6.1010 16.2918 0.0043 -0.0005
hfenergy: -2061.3437955 hartree
pointgroup: C01 [X(C9H7Cl3N2O3)]
dipole: 0.845083 -2.9380684 0.0010697 debye
dipolederiv: -0.3451819 0.0146593 0.1125402 0.125183 -0.324616 -0.3224972 0.1913386 -0.2495996 -0.5937853 -0.3452173 0.0144517 -0.112756 0.1248439 -0.3229486 0.3217955 -0.1917743 0.2488541 -0.5952392 -0.2902712 -0.2955254 0.0004346 -0.3124453 -0.5074804 0.00066 0.0004099 0.0006445 -0.0882368 -0.5053302 0.2258569 -0.0000794 -0.4835013 -0.8548219 0.0001884 0.0000716 0.0002066 -0.2526308 -0.947862 0.0716491 0.0000363 0.1348206 -0.4795354 0.0001395 -0.0002073 0.0001002 -0.2262681 -0.5132997 -0.0090259 -0.000051 0.0416982 -0.8201195 0.0001849 0.0000094 0.0003652 -0.214164 -1.5227057 -0.4454429 0.000159 -0.742039 -0.6559712 0.0000696 0.0004138 0.0002515 -0.2585135 1.4389092 -0.3087955 0.0001413 -0.4849825 1.4221594 -0.0005199 0.0002204 -0.0005175 0.1823653 1.1521997 0.2736324 -0.0001148 0.1906573 -0.2428387 0.0000845 -0.0001764 0.0000628 0.0830189 0.0323791 -0.2339352 0.0000778 -0.247812 0.2595145 -0.000103 0.0000893 -0.0000916 -0.049072 -0.1297756 -0.2826267 0.0001128 0.0949268 -0.0657455 -0.0000112 -0.0000076 -0.0000405 -0.1093944 -0.179154 0.216937 -0.0000859 0.1778082 0.0835564 -0.0000729 -0.0000574 -0.0000749 -0.1386517 -0.1868328 0.3171367 -0.0001474 0.3226958 -0.336712 0.0001773 -0.0000772 0.0001197 0.0504351 -0.1286819 0.027326 -0.0000286 -0.2203251 0.0577826 -0.0000596 0.0001267 -0.0000996 -0.1092518 -0.1038625 0.1461299 -0.0000533 0.0812068 -0.0644761 0.0000403 -0.0000276 -0.000023 0.0554485 1.2761572 0.0514566 0.0001435 0.9231238 1.154473 -0.000329 0.0001448 -0.0003785 0.0366405 0.6743114 0.2804746 -0.0003007 0.2489248 1.2209668 0.0001288 -0.0002539 0.0001457 1.3755053 0.2221397 -0.0110145 0.0000068 -0.0231556 0.130002 0.0000217 0.000009 0.0000262 0.1885578 0.0640184 -0.0331096 0.0000109 -0.0572549 -0.0851832 0.0000863 0.0000101 0.0000923 0.1469538 0.2438408 0.0392894 -0.0000938 0.0811572 0.2178637 -0.0000015 -0.0002585 -0.0000902 0.2575194 0.0470302 -0.0206133 0.0000139 0.0016816 0.1345956 0.0000135 -0.000005 0.0000106 0.1758927 0.0143497 0.0613348 -0.0991729 0.0335872 0.0612858 -0.0429325 -0.1101905 0.0018471 -0.0200875 0.0184611 -0.1616646 0.0000701 -0.0444797 -0.043063 0.0000719 0.0000247 0.0000895 0.1230998 0.0143781 0.061419 0.0991367 0.0336802 0.0613119 0.0428645 0.1101676 -0.0019004 -0.020142 unknown
polarizability: 215.6272917|1.8632134|181.1404156|-0.0002385|-0.0359822|90.1473006 unknown
InChI: InChI=1S/C9H7Cl3N2O3/c1-5-2-3-6(14(16)17)4-7(5)13-8(15)9(10,11)12/h2-4,13H,1H3
charge 0 multiplicity 1
24 atoms
Cl 3.931709 -0.653157 -1.5212
Cl 3.931807 -0.648977 1.523245
Cl 4.427192 1.920088 -0.002526
O  1.483681 1.810552 -0.000975
O  -4.655123 1.211502 -0.00096
O  -2.850136 2.605291 -0.00151
N  1.18653 -0.524973 -0.000209
N  -3.382076 1.430936 -0.000748
C  -0.231123 -0.652857 -0.000096
C  -0.765326 -1.98349 0.000385
C  -1.087301 0.473676 -0.000457
C  -2.169879 -2.142246 0.000479
C  -2.477455 0.25074 -0.000346
C  -3.045065 -1.038688 0.000118
C  0.147629 -3.195833 0.000786
C  1.93166 0.639391 -0.000496
C  3.478574 0.365465 -0.000341
H  -0.693783 1.491466 -0.000813
H  -2.584001 -3.15595 0.000849
H  1.713454 -1.40265 -0.000156
H  -4.131069 -1.156018 0.000185
H  0.799686 -3.225338 0.896563
H  -0.440597 -4.126871 0.001218
H  0.799511 -3.226059 -0.895095
