program: Gaussian 09
title: 000295445
version: EM64L-G09RevD.01
frameworkgroup: C1[X(C15H14N2O5)]
method: RPBEPBE
basis: SDD
operation: Freq
keyword: #p
keyword: freq=noraman
keyword: PBEPBE/SDD
title: #p freq=noraman PBEPBE/SDD
converged: YES YES NO NO
title: Mulliken charges:
elementType: O O O O O N N C C C C C C C C C C C C C C C H H H H H H H H H H H H H H
charge: -0.360049 -0.274901 -0.219794 -0.213331 -0.198211 -0.462442 0.016865 0.384125 0.550764 0.249103 -0.627511 -0.369371 -0.367511 -0.771763 0.293677 0.185003 0.207495 -0.308150 -0.321724 -0.239363 -0.212451 -0.511621 0.287921 0.243416 0.307091 0.216071 0.254045 0.253530 0.346205 0.244494 0.255563 0.232708 0.232933 0.229604 0.230328 0.237257
chargesum: 0.00000
title: Mulliken charges with hydrogens summed into heavy atoms:
elementType: O O O O O N N C C C C C C C C C C C C C C C
charge: -0.360049 -0.274901 -0.219794 -0.213331 -0.198211 -0.116237 0.016865 0.384125 0.550764 0.249103 -0.339591 -0.125956 -0.060420 -0.048118 0.293677 0.185003 0.207495 -0.063656 -0.066161 -0.006655 0.020482 0.185567
polarizability: 3.24401872e+02 -1.21169810e+01 1.76707081e+02 -7.29865665e+00 -4.60160292e+00 1.31624165e+02
1716.lowfreq: 0.0002 0.0005 0.0007 0.5965 3.0554 7.5402 13.1002 21.2714 27.2528
frequency: 11.5881 21.1953 27.2501 38.4445 57.4966 63.8562 70.5111 116.8490 134.0232 151.0669 185.5420 188.7909 208.5533 227.1380 231.8603 260.8528 291.5829 305.0249 340.8725 350.3240 375.9481 392.7646 421.5517 431.5056 460.9925 507.6172 523.1597 530.0356 552.2370 572.1742 612.9290 650.0005 659.5622 682.0389 686.3753 699.5709 715.0978 724.7624 731.1318 758.5975 764.2660 777.0305 835.1561 850.8884 852.4338 893.2112 918.4212 935.4437 967.0797 972.0041 975.4458 990.1185 1006.5856 1035.2191 1041.1561 1055.7729 1082.9132 1106.2502 1137.5169 1151.1392 1163.8864 1168.2858 1172.4225 1199.6931 1215.5297 1239.2949 1256.2435 1262.1853 1297.1504 1349.5298 1372.3337 1380.2697 1408.2898 1421.8019 1423.5077 1443.7604 1454.0126 1461.1778 1464.7486 1472.9820 1478.5663 1491.0982 1514.7112 1579.7262 1587.6682 1608.2722 1633.5126 1684.4742 2980.3330 2994.7653 3079.1649 3085.4654 3095.9196 3119.7581 3140.0532 3145.4074 3150.7740 3158.7534 3165.7715 3177.8100 3189.3700 3536.3658
redmass: 5.4522 6.0616 8.9684 4.5422 8.7129 3.7654 5.2386 5.8521 4.0120 3.1802 2.3981 4.4582 2.4290 1.0669 4.7979 3.5817 6.2407 5.3787 4.2097 4.7977 4.8294 7.5163 5.7336 3.4688 3.6061 5.7190 5.1510 5.2025 3.8723 4.6367 6.8971 2.0652 4.0693 4.0671 3.9171 3.3609 6.5042 5.3523 3.6351 3.1411 2.0505 4.7671 5.9599 1.5189 1.3000 5.8688 1.5284 1.3805 7.7249 7.8648 1.3180 1.3327 1.4720 1.9953 1.5398 2.9093 2.7466 1.2434 3.0046 1.3294 1.2655 1.3642 1.8252 5.2471 2.5900 3.1903 2.0186 1.5352 1.8904 3.5470 6.5112 9.2841 1.2535 4.3669 1.5078 1.8097 1.0463 1.0625 1.2323 1.1070 2.1194 2.0565 3.0684 4.8877 7.1073 6.6762 6.9039 9.3674 1.0317 1.0364 1.0960 1.1028 1.1013 1.1032 1.0855 1.0906 1.0904 1.0916 1.0948 1.1007 1.0951 1.0764
irintensity: 0.0768 0.2511 0.0093 1.8667 5.8303 6.8675 1.2925 7.1163 1.4766 1.7863 4.3321 0.5516 3.1058 0.5720 2.1023 5.9616 3.6348 2.3872 0.1463 0.7513 0.9156 0.1655 4.7954 0.6014 6.8722 6.2076 4.4263 2.9040 28.6795 7.7392 1.2712 16.5251 7.2218 7.6197 2.5629 43.5039 22.9358 17.8327 20.5462 16.2130 77.4811 10.8096 1.7698 5.5658 24.9362 43.9819 40.8266 2.1626 194.8690 57.0574 0.5284 1.9366 2.7527 34.8964 8.0440 16.4170 226.7553 6.9785 591.3772 3.5588 0.8736 4.5432 5.9413 255.6652 41.0903 203.1155 6.3004 7.7625 19.2900 199.8469 59.6911 23.3722 33.1733 39.1952 18.5087 32.2881 12.9704 15.5102 99.0661 56.8503 158.9232 27.7711 600.1131 38.1560 7.7510 34.0909 82.3821 225.2735 58.4939 15.0369 7.2574 34.8338 24.5383 30.6246 0.6138 11.5793 15.1380 11.2272 12.8660 13.0628 5.3089 36.1258
temp: 298.150 k
press: 1.00000 atm
elementType: 8 8 8 8 8 7 7 6 6 6 6 6 6 6 6 6 6 6 6 6 6 6 1 1 1 1 1 1 1 1 1 1 1 1 1 1
symmnumber: 1
zpe: 703067.9 jmol-1
zpe.correction: 0.267784 hartree
zpe.thermalcorrener: 0.288192 hartree
zpe.thermalcorrenthalpy: 0.289137 hartree
zpe.thermalcorrgfe: 0.214952 hartree
zpe.sumelectzpe: -1063.950525 hartree
zpe.sumelectthermal: -1063.930117 hartree
zpe.sumelectthermalent: -1063.929173 hartree
zpe.sumelectthermalfe: -1064.003357 hartree
dipole: 1.7908 -2.0917 1.1812
dipole: 2.9963
quadrupole: -143.9741 -128.9649 -124.5797
quadrupole: 12.3859 -11.2921 6.3050
quadrupole: -11.4678 3.5413 7.9265 12.3859 -11.2921 6.3050
hfenergy: -1064.2183099 hartree
pointgroup: C01 [X(C15H14N2O5)]
dipole: 0.7034329 -0.8079681 0.4919148 debye
polarizability: 324.4777031|-12.1599769|176.3672184|-6.1685623|-5.9965063|131.8881959 unknown
InChI: InChI=1S/C15H14N2O5/c1-10-7-8-11(9-12(10)17(19)20)16-15(18)22-14-6-4-3-5-13(14)21-2/h3-9,16H,1-2H3
charge 0 multiplicity 1
36 atoms
O  2.123931 0.569033 -0.54775
O  4.173283 1.965121 1.078271
O  1.262706 -1.314313 0.614488
O  -4.514631 2.217625 -1.465479
O  -6.123558 0.920465 -0.521167
N  -0.108893 0.338275 -0.394495
N  -4.885943 1.192145 -0.768851
C  -4.140474 -0.874235 0.527933
C  -1.419346 -0.098782 -0.070922
C  -3.828557 0.292285 -0.232486
C  -2.502594 0.677923 -0.530018
C  -3.016464 -1.625172 0.966288
C  -1.684104 -1.270435 0.689534
C  -5.530318 -1.356468 0.889317
C  3.478929 0.104652 -0.471308
C  4.429912 0.842814 0.282893
C  1.08692 -0.26347 -0.03801
C  3.868708 -1.010112 -1.241536
C  5.792827 0.456925 0.202057
C  5.223002 -1.395078 -1.295215
C  6.18779 -0.645661 -0.578688
C  2.879295 2.091316 1.774123
H  -2.353534 1.587533 -1.12025
H  -3.202401 -2.531473 1.55276
H  -0.855246 -1.883286 1.049903
H  -5.461313 -2.289871 1.473122
H  -6.083519 -0.605827 1.479827
H  -6.147227 -1.540122 -0.007282
H  -0.015504 1.186028 -0.959297
H  3.105539 -1.560069 -1.801782
H  6.51736 1.04189 0.776668
H  5.521828 -2.260429 -1.894633
H  7.245408 -0.92643 -0.620139
H  2.579631 1.1305 2.233023
H  2.091355 2.445943 1.089023
H  3.059201 2.839858 2.560979
