program: Gaussian 09
title: 000022649
version: EM64L-G09RevD.01
frameworkgroup: C1[X(C7H7N3O2)]
method: RPBEPBE
basis: SDD
operation: Freq
keyword: #pfreq=noraman
keyword: PBEPBE/SDD
title: #p freq=noraman PBEPBE/SDD
converged: NO YES NO NO
title: Mulliken charges:
elementType: O O N N N C C C C C C C H H H H H H H
charge: -0.238736 -0.267047 -0.319651 0.081432 -0.628697 0.492480 -0.314231 -0.350946 -0.214096 -0.212559 -0.236631 0.274549 0.264434 0.253755 0.233342 0.233650 0.234180 0.371261 0.343510
chargesum: 0.00000
title: Mulliken charges with hydrogens summed into heavy atoms:
elementType: O O N N N C C C C C C C
charge: -0.238736 -0.267047 -0.319651 0.081432 0.086074 0.492480 -0.049796 -0.097191 0.019246 0.021091 -0.002451 0.274549
polarizability: 1.55632317e+02 -1.15081365e+01 1.05052272e+02 4.01713612e+00 8.61178636e+00 5.41098253e+01
1716.lowfreq: -8.7879 -5.1161 -3.0957 -0.0016 -0.0012 -0.0009 57.0239 58.2730 105.2441
frequency: 57.0223 58.2437 105.2430 155.1195 262.7507 287.2270 298.3459 370.2799 382.8265 405.3152 414.4109 505.3602 546.7250 600.2145 614.0409 676.3940 680.4163 691.1793 716.6124 763.0232 779.9208 832.5740 886.1369 924.0718 962.6499 966.1211 989.5595 993.8736 1030.9108 1088.3488 1112.0350 1174.9411 1189.8792 1245.8151 1280.5396 1319.7409 1350.5081 1387.7430 1443.6561 1477.6405 1562.7986 1595.6072 1605.9110 1683.2136 3135.5972 3147.7244 3162.2113 3174.8313 3190.5990 3344.1142 3625.6403
redmass: 5.0680 5.9585 5.8915 6.8100 7.2511 7.5586 6.5209 4.3193 8.0071 2.8340 5.5852 3.7818 4.2090 1.4698 3.9831 4.9785 7.2858 1.8922 6.2025 1.8780 1.1194 1.2626 2.9274 1.9890 7.9762 1.3882 4.5022 1.4365 1.9914 1.6064 2.5052 1.0505 1.1127 4.7778 2.5835 1.4244 5.3594 10.5397 2.3027 2.2733 1.1987 6.4887 6.1035 9.4245 1.0855 1.0899 1.0949 1.0985 1.0968 1.0597 1.0932
irintensity: 0.4746 7.8650 1.9550 0.5451 5.9813 7.1193 4.5548 17.1668 3.2460 0.0822 3.6021 0.2953 36.5455 110.0295 28.2411 16.7601 14.6823 38.2527 19.0858 38.8235 189.9620 0.4033 170.7706 77.2388 49.4128 2.6691 0.2268 0.7463 5.3115 20.1975 0.9262 0.0365 2.1943 21.1612 121.8532 31.4938 249.8787 7.5406 12.3299 25.0177 195.3903 1.7039 0.3810 290.0787 0.0218 12.8247 25.6932 8.9702 1.9483 72.7308 88.5359
temp: 298.150 k
press: 1.00000 atm
elementType: 8 8 7 7 7 6 6 6 6 6 6 6 1 1 1 1 1 1 1
symmnumber: 1
zpe: 360408.9 jmol-1
zpe.correction: 0.137273 hartree
zpe.thermalcorrener: 0.147592 hartree
zpe.thermalcorrenthalpy: 0.148536 hartree
zpe.thermalcorrgfe: 0.100749 hartree
zpe.sumelectzpe: -584.733348 hartree
zpe.sumelectthermal: -584.723029 hartree
zpe.sumelectthermalent: -584.722085 hartree
zpe.sumelectthermalfe: -584.769871 hartree
dipole: -0.3419 0.3227 -0.0165
dipole: 0.4704
quadrupole: -51.9966 -75.3482 -70.5280
quadrupole: 5.5915 -1.3268 7.5231
quadrupole: 13.9610 -9.3906 -4.5704 5.5915 -1.3268 7.5231
hfenergy: -584.8706202 hartree
pointgroup: C01 [X(C7H7N3O2)]
dipole: -0.136107 0.1240051 -0.018731 debye
dipolederiv: -0.6732949 0.0041418 -0.0457362 0.1716653 -0.9203189 0.2441851 -0.0381955 0.2316855 -0.4252488 -1.3819026 0.7379857 -0.2876739 0.1057725 -0.4307429 0.1028197 0.0651562 0.0458519 -0.2075454 -0.328506 -0.197279 0.0706973 0.3439162 -1.1139422 0.3377428 -0.1200299 0.3061582 -0.168451 0.9636635 -0.9090602 0.3405314 -0.7660416 0.7969687 -0.3320776 0.0606087 -0.2334347 0.0390662 -1.1511418 0.0256844 -0.0601991 -0.1057429 -0.4135823 -0.0743953 -0.0162999 -0.0774982 -0.6542813 0.5467649 0.0405609 0.0126542 -0.1121524 0.009534 0.0899811 0.1093205 0.0426877 0.076267 -0.0388369 0.0905742 0.0325777 0.0295576 0.0301629 0.0310754 -0.015634 0.0047264 -0.0852761 -0.0136215 -0.1012479 -0.013717 -0.008175 -0.0575803 0.0583417 0.0340121 0.0299043 -0.1007391 -0.0489018 -0.113582 -0.0423007 -0.1099772 0.0518279 0.0901045 -0.0584011 0.0778585 -0.1152664 -0.0811319 0.1137443 0.0425441 0.1178334 0.0226042 0.102334 0.0615444 0.0844201 -0.0989206 0.1044964 -0.0080227 0.0205455 -0.0227149 -0.050211 0.0347601 0.003525 0.0531478 -0.1291885 1.4851026 0.3010652 -0.0259017 0.0974309 1.4054045 -0.435091 0.0278934 -0.3671514 0.4972165 0.0824169 -0.0576978 -0.0412565 -0.0556249 0.0451235 -0.0645445 -0.0498015 -0.0381925 0.1186264 0.0371388 0.0765298 0.0286704 0.0613473 0.0433059 -0.0712031 0.0308682 -0.0498994 0.1304696 0.0232939 0.0734307 0.027647 0.0910756 -0.0216144 -0.0834631 0.031022 -0.079424 0.11941 0.0211344 -0.0644788 -0.0441122 -0.0840878 -0.0089133 -0.0922177 -0.0460849 -0.0908835 0.109801 -0.1237937 0.0091333 -0.0184623 0.006947 0.1064178 -0.0287946 -0.0146408 -0.0243878 0.1493525 0.3263209 -0.0131658 0.0018735 0.2417675 0.3281467 0.0189804 -0.0617754 0.0179972 0.3863428 0.2507989 -0.0083162 0.0016187 -0.0027966 0.1774092 0.071462 -0.0030875 0.0664339 0.3583652 unknown
polarizability: 155.4653339|-10.6250332|105.4072114|8.7864789|5.6053881|53.9218689 unknown
InChI: InChI=1S/C7H7N3O2/c8-7(11)10(9-12)6-4-2-1-3-5-6/h1-5H,8H2
charge 0 multiplicity 1
19 atoms
O  1.245488 2.076289 -0.517376
O  2.631644 -1.658436 0.744943
N  0.944621 -0.160344 0.254019
N  1.364619 -1.450513 0.680426
N  3.129995 0.803089 0.017772
C  -0.499236 -0.071002 0.139308
C  -1.196807 1.050167 0.647942
C  -1.198913 -1.149594 -0.453895
C  -2.603726 1.086757 0.552327
C  -2.606513 -1.104786 -0.5337
C  -3.313258 0.012889 -0.033749
C  1.78369 1.014145 -0.118746
H  -0.65009 1.881292 1.098271
H  -0.642715 -2.00565 -0.846633
H  -3.145423 1.955533 0.940848
H  -3.147949 -1.938816 -0.992476
H  -4.405634 0.049337 -0.104094
H  3.476126 -0.119678 0.318889
H  3.747382 1.575021 -0.230878
