program: Gaussian 09
title: 000295424
version: EM64L-G09RevD.01
frameworkgroup: C1[X(C16H17ClN2O)]
method: RPBEPBE
basis: SDD
operation: Freq
keyword: #p
keyword: freq=noraman
keyword: PBEPBE/SDD
title: #p freq=noraman PBEPBE/SDD
converged: YES YES NO NO
title: Mulliken charges:
elementType: Cl O N N C C C C C C C C C C C C C C C C H H H H H H H H H H H H H H H H H
charge: -0.071965 -0.282735 -0.511041 -0.501073 0.384658 0.330208 0.506422 -0.682850 0.323343 -0.414864 -0.360038 0.262492 -0.814104 -0.814214 0.267114 -0.342207 -0.197906 -0.781903 -0.222259 -0.268729 0.216369 0.229595 0.305463 0.289428 0.225544 0.227803 0.227873 0.268400 0.223460 0.231937 0.223817 0.313293 0.264171 0.189888 0.264290 0.233157 0.257162
chargesum: 0.00000
title: Mulliken charges with hydrogens summed into heavy atoms:
elementType: Cl O N N C C C C C C C C C C C C C C C C
charge: -0.071965 -0.282735 -0.221613 -0.232673 0.384658 0.330208 0.506422 -0.466480 0.323343 -0.185269 -0.054575 0.262492 -0.132885 -0.134999 0.267114 -0.028914 -0.197906 -0.063553 0.010898 -0.011567
polarizability: 3.67470988e+02 -2.22085263e+00 2.08814529e+02 -7.48259700e-02 -1.06748883e-01 9.14889449e+01
1716.lowfreq: -140.0902 -9.0286 -3.5626 -0.0014 -0.0010 0.0017 4.6252 12.3676 25.2882
frequency: -140.0872 8.6101 25.2793 54.1519 59.1071 64.5350 99.0789 118.8907 138.8425 145.5500 150.4890 185.8058 203.0225 216.8581 249.3652 280.7437 285.1613 311.4442 326.6841 332.1929 374.7476 436.0885 438.6450 452.6620 460.8628 495.1356 501.4290 529.3261 562.7179 572.1795 585.2543 618.6930 643.1016 695.9502 715.2468 720.7959 732.3800 752.7848 782.0213 787.8182 793.2705 847.9538 865.8344 868.4986 909.4294 923.0120 976.7711 980.5756 989.6780 992.3392 997.8190 1029.4967 1031.3719 1034.9267 1051.4347 1073.1079 1124.9383 1141.7585 1169.4247 1191.8757 1198.9958 1214.2583 1228.3340 1269.3663 1295.1580 1312.4871 1352.9571 1366.7520 1392.0823 1397.3515 1407.6111 1408.5340 1423.8866 1450.1030 1455.7803 1459.5752 1466.0682 1472.9491 1476.8344 1477.9413 1503.1308 1510.5254 1518.0827 1584.1036 1596.3602 1610.8199 1629.1330 1654.8795 2965.7777 2970.5274 2988.0554 3036.1648 3044.4345 3070.6365 3075.4767 3080.2927 3083.0310 3092.8084 3127.2832 3148.1349 3180.5803 3198.9643 3201.1312 3522.6235 3547.9894
redmass: 1.0504 3.5993 5.3843 5.7186 5.0112 6.9039 1.0785 3.3851 1.5241 1.6100 6.5571 5.7380 4.0200 2.7406 6.0932 3.3593 2.5954 5.3757 3.0487 5.9646 7.5191 3.7051 1.9299 2.1652 4.4088 4.1678 3.4742 4.9881 3.6379 5.9299 3.0557 1.3272 6.6040 11.5996 2.7954 2.5974 5.3368 4.6962 6.5366 1.4550 4.9996 1.2819 1.5669 4.7848 1.3543 3.8434 1.3199 1.8116 1.3065 1.6140 1.6558 1.4414 1.4774 2.9928 1.6400 2.1683 2.0876 1.7814 1.9664 1.8583 1.5835 1.8893 1.7493 2.1368 1.8885 2.3515 5.1035 5.8516 1.2525 2.2103 1.4233 1.4649 2.3372 2.2270 1.0417 1.0472 1.1348 1.0466 1.3540 1.2091 2.2648 2.1516 2.2396 4.2164 5.1270 7.0980 6.3355 3.6664 1.0379 1.0377 1.0372 1.0969 1.0970 1.0982 1.0972 1.0985 1.0976 1.0907 1.0906 1.0888 1.0954 1.0952 1.0942 1.0761 1.0747
irintensity: 1.2705 0.2792 0.0066 0.0246 1.0250 8.8737 0.0434 0.0230 3.0272 0.0262 6.3834 1.3275 0.3559 4.4449 0.2668 8.7174 1.2038 5.0559 0.1744 1.4781 15.8076 1.5359 5.3226 1.3135 4.1555 1.9810 0.2417 0.8554 13.4533 9.1196 20.0999 114.9298 13.8530 22.4249 2.6714 3.8512 4.1772 6.3920 4.7374 69.3073 0.0914 27.3914 39.1538 12.4803 4.2582 0.1176 7.2264 2.8011 4.5317 11.0531 77.3243 14.4005 7.7622 18.7787 0.1363 8.9342 14.0148 2.7716 196.5226 209.6132 8.4754 38.9076 58.2675 49.0065 138.8506 3.4701 25.1139 223.9072 4.7180 26.9035 45.8206 9.0556 300.6502 48.1158 12.8236 0.0968 80.9742 30.6160 150.1135 31.5529 554.8911 303.7294 183.9339 236.8990 23.9640 40.8046 69.5402 93.5180 63.1051 34.4447 27.8614 34.6869 11.5028 9.5461 46.5247 31.9362 6.0117 31.6000 19.6485 9.8312 3.1020 17.8583 4.7114 13.3952 30.7779
temp: 298.150 k
press: 1.00000 atm
elementType: 17 8 7 7 6 6 6 6 6 6 6 6 6 6 6 6 6 6 6 6 1 1 1 1 1 1 1 1 1 1 1 1 1 1 1 1 1
symmnumber: 1
zpe: 769050.1 jmol-1
zpe.correction: 0.292916 hartree
zpe.thermalcorrener: 0.312177 hartree
zpe.thermalcorrenthalpy: 0.313121 hartree
zpe.thermalcorrgfe: 0.242626 hartree
zpe.sumelectzpe: -1263.288768 hartree
zpe.sumelectthermal: -1263.269507 hartree
zpe.sumelectthermalent: -1263.268562 hartree
zpe.sumelectthermalfe: -1263.339057 hartree
dipole: -2.5329 3.6517 -0.0144
dipole: 4.4442
quadrupole: -121.6960 -114.2154 -131.5038
quadrupole: -6.8316 -0.0494 -0.0537
quadrupole: 0.7757 8.2564 -9.0321 -6.8316 -0.0494 -0.0537
hfenergy: -1263.5816839 hartree
pointgroup: C01 [X(C16H17Cl1N2O1)]
dipole: -1.058716 -1.3906862 -0.0482196 debye
polarizability: 367.3534348|-4.7014827|208.7223245|-1.4684935|4.8904005|91.6987022 unknown
InChI: InChI=1S/C16H17ClN2O/c1-10-7-8-13(9-11(10)2)18-16(20)19-15-6-4-5-14(17)12(15)3/h4-9,18-19H,1-3H3
charge 0 multiplicity 1
37 atoms
Cl 6.483711 -1.524778 -0.118778
O  0.097367 1.604392 0.056434
N  -0.975776 -0.491827 -0.019184
N  1.352628 -0.401779 -0.029517
C  -4.699939 -0.873263 -0.022722
C  -5.145722 0.483454 0.024806
C  -2.347954 -0.102173 -0.001661
C  -3.314315 -1.143414 -0.034755
C  2.688994 0.084837 -0.01691
C  -4.170545 1.508213 0.057604
C  -2.784492 1.244696 0.045251
C  3.757853 -0.874733 -0.069659
C  -5.698512 -2.016585 -0.059636
C  -6.625581 0.821762 0.0403
C  0.153457 0.341882 0.007074
C  2.971242 1.477644 0.046256
C  5.071833 -0.351015 -0.053806
C  3.552168 -2.379534 -0.140639
C  4.303699 1.929168 0.05855
C  5.380776 1.018096 0.008723
H  -2.980322 -2.190328 -0.07082
H  -4.50291 2.552775 0.094307
H  -2.052265 2.052326 0.07116
H  -0.825725 -1.502291 -0.055904
H  -5.192325 -2.996475 -0.092475
H  -6.358449 -2.006731 0.829143
H  -6.359836 -1.948403 -0.944859
H  1.266626 -1.41728 -0.071861
H  -7.140795 0.372333 0.911529
H  -6.781605 1.912893 0.08505
H  -7.143283 0.444772 -0.863285
H  2.137542 2.179426 0.083993
H  4.034513 -2.879637 0.718379
H  2.495475 -2.698556 -0.147395
H  4.019629 -2.793736 -1.052038
H  4.506884 3.003926 0.107704
H  6.420059 1.355243 0.017737
