program: Gaussian 09
title: 000295433
version: EM64L-G09RevD.01
frameworkgroup: C1[X(C15H23N3O3)]
method: RPBEPBE
basis: SDD
operation: Freq
keyword: #p
keyword: freq=noraman
keyword: PBEPBE/SDD
title: #p freq=noraman PBEPBE/SDD
converged: YES YES NO NO
title: Mulliken charges:
elementType: O O O N N N C C C C C C C C C C C C C C C H H H H H H H H H H H H H H H H H H H H H H H
charge: -0.277532 -0.215612 -0.199739 -0.412346 -0.508005 0.017709 -0.377022 -0.361730 -0.366229 -0.351767 -0.400374 -0.355108 -0.695083 0.285113 0.365416 0.264981 -0.479820 -0.355335 0.405879 -0.845671 -0.408268 0.188320 0.186174 0.189303 0.195908 0.238091 0.202086 0.186070 0.184516 0.209831 0.259066 0.197636 0.196027 0.287311 0.209022 0.217682 0.208914 0.313893 0.358072 0.238321 0.234663 0.230646 0.253234 0.285756
chargesum: 0.00000
title: Mulliken charges with hydrogens summed into heavy atoms:
elementType: O O O N N N C C C C C C C C C C C C C C C
charge: -0.277532 -0.215612 -0.199739 -0.125035 -0.194112 0.017709 -0.002528 0.023480 0.073948 0.018819 0.068523 0.038556 -0.059465 0.285113 0.365416 0.264981 -0.121748 -0.117014 0.405879 -0.127128 -0.122512
polarizability: 2.55540639e+02 1.45279471e+01 2.11568570e+02 4.05318806e+01 -1.08075952e+01 1.56116732e+02
1716.lowfreq: 0.0003 0.0006 0.0008 1.6997 2.7016 7.9003 13.6344 19.7020 39.8629
frequency: 11.3142 18.2074 39.8619 47.9761 53.0982 58.5376 71.8278 82.2857 102.9285 106.8788 117.4762 128.2520 150.0744 192.4801 198.1585 206.2522 218.2582 245.9627 247.4280 272.2284 288.0528 313.8766 341.4868 350.3249 368.4504 396.3674 417.3914 442.0829 446.0637 520.7799 525.0672 542.3762 573.1289 594.1304 622.2897 698.6574 701.1966 709.7248 724.0379 724.3158 737.1767 752.4070 773.0009 795.7851 832.4913 853.7940 875.0258 899.5731 918.1560 930.4114 961.2128 967.8985 977.0863 991.8177 1000.5861 1024.9702 1043.3476 1059.3352 1067.8250 1075.7903 1089.8640 1110.0726 1123.1614 1135.9510 1141.8520 1183.8340 1196.0883 1205.6748 1217.1308 1231.2143 1245.7145 1265.1848 1270.9080 1276.1549 1283.2090 1291.3691 1296.6549 1304.0531 1337.1184 1350.5223 1353.6927 1368.2163 1369.6339 1385.6917 1389.2026 1396.4955 1430.5985 1446.0128 1455.9023 1458.5459 1462.3889 1465.7883 1473.9716 1479.0852 1479.5734 1480.2265 1482.5854 1488.7327 1489.9340 1515.1672 1594.9200 1619.1441 1651.9502 2946.0001 2952.0718 2954.0759 2962.1452 2970.3369 2972.5787 2979.5342 2985.9261 2994.9200 2999.2534 3017.7307 3022.7695 3035.8908 3050.3558 3069.1587 3072.4893 3078.0861 3091.9794 3140.2408 3192.4739 3194.1565 3543.8114 3556.5762
redmass: 5.5077 4.6877 6.4173 1.9153 9.5311 2.8579 4.7381 3.6974 3.2499 3.5650 2.1578 2.6424 2.4202 3.0240 1.4498 3.2875 2.4760 1.1414 2.9112 3.6568 4.8963 3.6247 3.1364 3.2764 2.0295 2.7339 3.5527 3.2161 3.0766 2.6837 5.0343 2.0904 1.9141 5.3284 6.5714 4.0712 6.8065 6.6916 1.6538 1.6017 1.1919 8.1159 1.8056 2.1390 1.3666 1.6824 2.1216 1.7967 2.1165 3.4783 1.4077 1.3417 1.9319 1.6797 2.1122 2.1154 1.5391 2.5588 2.4409 2.2315 2.1908 3.3501 2.7063 1.5543 1.6233 2.1918 1.6000 2.1293 4.6159 1.5392 1.3249 1.5176 1.3509 2.1803 1.1682 1.1081 1.1024 1.2321 1.3931 1.4955 1.6180 1.7153 4.1457 3.6191 1.2141 1.3108 3.4535 1.2293 1.7074 1.1404 1.0682 1.0780 1.0828 1.0943 1.0423 1.3747 1.1045 1.0963 1.5623 2.1952 6.8734 6.3799 4.5324 1.0581 1.0584 1.0402 1.0591 1.0569 1.0382 1.0660 1.0922 1.0975 1.0664 1.1025 1.0975 1.1037 1.1007 1.1007 1.0993 1.1011 1.0948 1.0906 1.0942 1.0931 1.0761 1.0768
irintensity: 0.8065 0.9751 0.9480 0.9968 7.5707 2.5702 0.6231 1.4103 0.1999 1.9629 0.3244 0.2514 0.1594 0.1177 0.3652 3.1119 0.9586 0.0895 1.9232 0.6697 5.5062 3.2968 12.3787 5.5239 30.0933 6.8456 1.2507 3.1495 12.4674 0.7272 5.9842 85.3200 86.0213 7.4093 2.8815 3.4620 2.0210 42.2375 8.9497 6.1055 1.2978 25.9980 3.2297 5.7567 28.0663 3.3592 1.6219 2.6907 3.0322 3.0307 28.5288 7.3170 4.1237 14.7775 0.6826 3.9911 7.2928 7.3775 10.5349 17.7408 1.3044 4.6993 5.8308 18.0844 0.8026 89.9452 4.8696 246.6409 199.0425 79.1061 3.9114 40.1365 71.4774 39.7156 2.2909 1.4663 0.9992 41.4104 6.8961 3.6158 2.9083 56.2481 60.7450 73.1165 11.1013 18.7104 133.2745 51.5005 36.9239 5.8681 3.5097 1.0782 14.6992 78.6779 13.7411 382.6224 45.1308 20.5245 2.4533 395.0075 32.0440 36.7833 158.2505 13.3447 5.6447 26.9189 22.8001 99.2435 27.7697 35.6699 14.6606 7.5914 37.1323 0.3492 19.3651 43.5681 112.4085 96.7802 52.6956 13.1543 14.4888 16.2152 4.3113 26.9182 10.0586 24.2099
temp: 298.150 k
press: 1.00000 atm
elementType: 8 8 8 7 7 7 6 6 6 6 6 6 6 6 6 6 6 6 6 6 6 1 1 1 1 1 1 1 1 1 1 1 1 1 1 1 1 1 1 1 1 1 1 1
symmnumber: 1
zpe: 959899.9 jmol-1
zpe.correction: 0.365607 hartree
zpe.thermalcorrener: 0.388491 hartree
zpe.thermalcorrenthalpy: 0.389435 hartree
zpe.thermalcorrgfe: 0.309710 hartree
zpe.sumelectzpe: -973.661648 hartree
zpe.sumelectthermal: -973.638763 hartree
zpe.sumelectthermalent: -973.637819 hartree
zpe.sumelectthermalfe: -973.717544 hartree
dipole: 5.6154 8.7056 0.3551
dipole: 10.3656
quadrupole: -142.1769 -127.1058 -126.8815
quadrupole: -25.0772 4.4856 0.2874
quadrupole: -10.1221 4.9489 5.1732 -25.0772 4.4856 0.2874
hfenergy: -974.0272541 hartree
pointgroup: C01 [X(C15H23N3O3)]
dipole: 2.2259043 -2.5816564 -2.2387014 debye
polarizability: 255.918086|13.9734295|200.4911476|-40.2921247|24.6992353|166.816707 unknown
InChI: InChI=1S/C15H23N3O3/c1-3-4-5-6-7-10-16-15(19)17-14-11-13(18(20)21)9-8-12(14)2/h8-9,11,16-17H,3-7,10H2,1-2H3
charge 0 multiplicity 1
44 atoms
O  -0.296955 1.786766 -0.691956
O  -5.54712 0.753027 2.311357
O  -3.782718 2.143298 1.926637
N  1.238921 0.545065 -1.934952
N  -0.785627 -0.45222 -1.297628
N  -4.417806 1.035115 1.747088
C  4.117527 0.507723 -0.681374
C  5.074429 0.612248 0.527715
C  3.174433 1.725115 -0.804821
C  6.033244 -0.592644 0.661426
C  2.205044 1.658486 -2.007947
C  6.978941 -0.485802 1.879437
C  7.94004 -1.687978 2.003653
C  0.031285 0.704563 -1.260508
C  -2.023462 -0.657042 -0.6416
C  -2.694307 -1.906503 -0.866333
C  -2.59625 0.314523 0.217371
C  -3.924919 -2.145048 -0.212399
C  -3.822146 0.017923 0.842469
C  -2.101207 -2.956179 -1.788435
C  -4.50972 -1.197716 0.649425
H  3.517349 -0.421443 -0.58288
H  4.71454 0.403511 -1.612743
H  5.669462 1.545501 0.442383
H  4.476255 0.710601 1.457244
H  2.57736 1.840126 0.120059
H  3.779993 2.648845 -0.907295
H  6.639186 -0.686352 -0.26438
H  5.440719 -1.528536 0.741466
H  2.771336 1.556689 -2.953652
H  1.616888 2.59099 -2.056843
H  6.372863 -0.397709 2.804028
H  7.565862 0.45221 1.80292
H  1.538069 -0.375321 -2.258897
H  8.578549 -1.779308 1.104548
H  8.604867 -1.587226 2.881131
H  7.378129 -2.63502 2.112878
H  -0.471932 -1.220206 -1.89246
H  -2.101631 1.273338 0.381309
H  -4.434498 -3.099311 -0.385728
H  -1.977839 -2.577207 -2.823404
H  -1.110397 -3.309135 -1.435968
H  -2.755507 -3.840789 -1.845592
H  -5.459453 -1.376666 1.157751
