program: Gaussian 09
title: 000295435
version: EM64L-G09RevD.01
frameworkgroup: C1[X(C15H11Cl3N2O4)]
method: RPBEPBE
basis: SDD
operation: Freq
keyword: #p
keyword: freq=noraman
keyword: PBEPBE/SDD
title: #p freq=noraman PBEPBE/SDD
converged: NO YES NO NO
title: Mulliken charges:
elementType: Cl Cl Cl O O O O N N C C C C C C C C C C C C C C C H H H H H H H H H H H
charge: -0.004584 0.017158 0.013694 -0.280728 -0.224063 -0.208681 -0.196437 -0.468569 0.019403 0.373983 0.271809 -0.485178 -0.352027 0.406735 -0.397807 -0.837423 0.169718 -0.460475 0.557924 -0.351182 -0.272472 -0.104006 -0.184531 -0.120826 0.353566 0.385727 0.244031 0.289121 0.240697 0.250951 0.243587 0.253447 0.280170 0.289361 0.287908
chargesum: 0.00000
title: Mulliken charges with hydrogens summed into heavy atoms:
elementType: Cl Cl Cl O O O O N N C C C C C C C C C C C C C C C
charge: -0.004584 0.017158 0.013694 -0.280728 -0.224063 -0.208681 -0.196437 -0.082843 0.019403 0.373983 0.271809 -0.131612 -0.107996 0.406735 -0.108686 -0.102187 0.169718 0.073142 0.557924 -0.351182 0.016890 -0.104006 0.103377 -0.120826
polarizability: 2.56237417e+02 -1.47703397e+01 2.36613607e+02 6.23879023e+00 -2.17683406e+01 1.90363031e+02
1716.lowfreq: -6.0508 -4.4912 -1.0233 -0.0028 -0.0023 -0.0018 9.9982 12.1098 20.0200
frequency: 9.5685 11.9985 19.8898 45.5000 53.6291 59.6929 82.7651 92.4892 104.9162 121.9258 163.7168 174.7240 187.3877 189.3009 193.7901 219.1817 233.9666 251.8417 267.0337 298.4198 316.9441 323.9849 348.8744 352.1368 402.2776 409.8789 434.3176 445.8499 450.6005 487.5107 498.0453 528.5497 540.9613 576.2399 593.7628 606.4010 624.5183 649.6478 662.2915 684.7471 693.3625 703.2177 718.1652 748.4924 749.6965 798.9344 837.1580 839.9053 851.2484 862.7980 911.4962 940.0511 964.3530 976.6689 980.4842 994.4442 1001.8393 1035.8304 1041.8437 1075.7236 1120.5205 1136.8270 1183.0041 1192.9773 1208.7869 1217.1417 1227.4384 1244.3188 1267.2255 1273.2444 1312.4309 1336.7865 1368.0764 1370.6241 1390.7826 1402.3423 1427.7795 1447.6038 1459.4479 1463.7476 1480.6740 1486.2863 1523.9611 1560.1703 1585.9945 1598.2976 1617.1247 1634.1093 2966.2971 3034.8338 3037.3627 3098.2511 3102.3030 3144.0021 3177.6638 3182.0629 3190.2535 3193.1889 3484.2093
redmass: 10.6784 10.8447 7.8092 12.3530 13.8575 17.7794 9.4156 4.8552 4.5083 10.3068 8.6221 12.2231 17.9509 1.2933 3.2283 5.6086 5.1144 8.0405 4.8865 7.0448 6.5183 4.8924 8.8844 9.5672 5.6573 4.9090 4.1449 4.0806 3.5298 6.8887 6.8394 5.0806 4.5828 5.0353 4.6649 10.5091 6.4215 7.6493 5.7269 3.2814 7.0891 3.9848 2.2398 1.5668 8.3305 5.7098 1.5920 1.3517 8.6103 1.3844 6.4374 3.9451 1.4110 1.3466 7.0624 1.6675 2.1016 5.3558 1.5786 2.0421 1.8933 1.5434 2.5988 2.2854 1.8509 8.2833 2.2451 1.2956 1.9614 1.7099 1.7519 2.9961 10.0813 9.3969 3.7749 1.4239 3.4748 2.8268 1.3077 1.6892 1.0446 1.4157 2.2306 8.6567 8.4537 6.5072 6.0952 6.8016 1.0403 1.0580 1.0974 1.0954 1.1068 1.0908 1.0918 1.0933 1.0946 1.0932 1.0759
irintensity: 1.4365 0.5977 1.5534 0.0680 4.2829 0.4568 0.4534 0.8440 1.0940 0.4353 2.5303 1.0885 0.4448 2.3858 1.2605 0.8217 0.3753 11.4928 1.7786 4.9721 4.7094 0.3113 0.3167 3.5634 11.3615 0.6860 16.4341 4.4458 4.0087 18.3673 15.4372 3.6289 2.9959 1.6705 1.9647 1.3172 4.4374 61.3441 3.4089 0.6606 19.7786 1.7209 56.3742 66.0213 24.6141 10.0559 15.7173 28.6127 9.4642 36.8343 14.1844 9.8420 27.9903 3.5922 52.1408 12.0008 11.5810 124.8468 7.3538 30.3831 67.8306 6.9871 8.8843 54.0994 10.8043 295.7911 85.8262 5.0502 39.5928 7.4790 30.9419 50.0860 8.8655 102.4396 29.3584 12.0908 90.5985 327.7288 82.9679 18.1235 14.4579 62.2968 340.4142 2.6730 22.1936 69.5945 34.6523 127.7508 14.4888 13.9921 13.6818 14.5150 5.5863 12.1335 0.9726 1.4622 2.8271 19.0873 62.9402
temp: 298.150 k
press: 1.00000 atm
elementType: 17 17 17 8 8 8 8 7 7 6 6 6 6 6 6 6 6 6 6 6 6 6 6 6 1 1 1 1 1 1 1 1 1 1 1
symmnumber: 1
zpe: 619624.6 jmol-1
zpe.correction: 0.236003 hartree
zpe.thermalcorrener: 0.258687 hartree
zpe.thermalcorrenthalpy: 0.259631 hartree
zpe.thermalcorrgfe: 0.179219 hartree
zpe.sumelectzpe: -2366.976534 hartree
zpe.sumelectthermal: -2366.953850 hartree
zpe.sumelectthermalent: -2366.952905 hartree
zpe.sumelectthermalfe: -2367.033317 hartree
dipole: -4.3989 6.1203 -0.8728
dipole: 7.5875
quadrupole: -198.8582 -164.8542 -152.8279
quadrupole: 20.3549 -7.6474 -2.7615
quadrupole: -26.6781 7.3259 19.3522 20.3549 -7.6474 -2.7615
hfenergy: -2367.2125362 hartree
pointgroup: C01 [X(C15H11Cl3N2O4)]
dipole: -1.2576954 -1.0624926 2.4900649 debye
polarizability: 243.2969672|-12.0356399|190.6243957|-20.9401751|-15.7951373|249.2926918 unknown
InChI: InChI=1S/C15H11Cl3N2O4/c1-8-2-3-9(20(22)23)4-13(8)19-15(21)7-24-14-6-11(17)10(16)5-12(14)18/h2-6,19H,7H2,1H3
charge 0 multiplicity 1
35 atoms
Cl -2.498376 -1.851141 2.910912
Cl -3.666483 2.6639 -1.500558
Cl -4.553202 3.130823 1.639874
O  -1.912425 -2.054975 0.024349
O  0.270488 -1.514208 -2.862798
O  6.091309 0.571998 -2.410661
O  4.34461 -0.008428 -3.756588
N  0.685476 -1.512808 -0.531974
N  4.887514 0.140078 -2.59633
C  2.012664 -1.014943 -0.432154
C  2.563571 -0.862727 0.883259
C  2.772554 -0.685102 -1.579771
C  3.886902 -0.379132 1.00412
C  4.084115 -0.2068 -1.394978
C  4.665443 -0.045724 -0.121099
C  1.753263 -1.209183 2.118796
C  -0.082401 -1.721554 -1.668155
C  -1.470064 -2.324094 -1.356506
C  -2.496547 -0.811944 0.313558
C  -2.861193 -0.586666 1.666377
C  -2.744534 0.203669 -0.638539
C  -3.370294 1.404292 -0.24207
C  -3.483874 0.607381 2.060732
C  -3.746599 1.608928 1.10072
H  2.357349 -0.796424 -2.583185
H  0.210161 -1.742487 0.347506
H  4.313723 -0.261308 2.005881
H  5.68796 0.328037 -0.03232
H  1.461795 -2.278135 2.140793
H  2.335024 -1.01459 3.0337
H  0.824404 -0.609303 2.190889
H  -2.197076 -1.976076 -2.109506
H  -1.408253 -3.424061 -1.41144
H  -2.451323 0.08979 -1.684781
H  -3.764983 0.76312 3.105147
