program: Gaussian 09
title: 000295430
version: EM64L-G09RevD.01
frameworkgroup: C1[X(C15H11Cl3N2O4)]
method: RPBEPBE
basis: SDD
operation: Freq
keyword: #p
keyword: freq=noraman
keyword: PBEPBE/SDD
title: #p freq=noraman PBEPBE/SDD
converged: YES YES NO NO
title: Mulliken charges:
elementType: Cl Cl Cl O O O O N N C C C C C C C C C C C C C C C H H H H H H H H H H H
charge: 0.010051 0.001287 0.004153 -0.262605 -0.238160 -0.190135 -0.245035 -0.449115 0.026208 0.354605 0.200762 0.501844 -0.558845 -0.310868 -0.358510 -0.450377 0.154584 -0.800939 0.557841 -0.347563 -0.263305 -0.104780 -0.182617 -0.121163 0.292991 0.318041 0.243929 0.404137 0.252114 0.279884 0.234778 0.237103 0.238084 0.285715 0.285904
chargesum: 0.00000
title: Mulliken charges with hydrogens summed into heavy atoms:
elementType: Cl Cl Cl O O O O N N C C C C C C C C C C C C C C C
charge: 0.010051 0.001287 0.004153 -0.262605 -0.238160 -0.190135 -0.245035 -0.044978 0.026208 0.354605 0.200762 0.501844 -0.265854 0.007174 -0.114581 0.081621 0.154584 -0.090973 0.557841 -0.347563 0.022409 -0.104780 0.103288 -0.121163
polarizability: 2.49285021e+02 -2.12128971e+01 2.30628948e+02 1.22781377e+00 -1.85352922e+01 2.15282927e+02
1716.lowfreq: -6.5187 -3.1261 -0.6027 -0.0014 0.0004 0.0007 12.4206 15.0702 22.2354
frequency: 12.3519 14.9294 22.1637 48.3755 53.2768 56.8203 62.2449 92.2318 98.2577 127.5044 153.4087 167.1260 181.7231 183.1274 193.8400 201.8274 218.1955 241.8772 285.6928 294.4626 318.4919 347.0023 357.4316 372.5728 392.1845 409.1288 430.0751 439.5496 445.0021 455.1121 495.4950 507.9342 535.5877 576.1516 604.7985 607.5731 649.8532 651.8014 664.4497 675.6151 688.4161 694.9527 728.4981 742.6848 832.0383 837.4578 853.7364 860.5010 863.2954 891.6062 921.3306 931.0087 948.7528 993.9615 1001.9319 1003.2896 1004.5636 1041.7538 1052.3732 1069.2470 1121.6347 1147.4954 1161.6024 1208.4418 1218.3888 1225.6795 1237.2367 1244.7715 1252.4963 1302.9154 1318.1715 1337.5092 1345.7560 1367.2817 1370.0534 1401.1560 1421.2082 1451.5211 1454.9400 1468.1590 1469.7135 1500.4232 1518.9952 1561.4754 1576.9451 1588.8402 1611.4910 1630.7143 2982.3077 3021.4341 3060.8375 3091.5550 3094.1558 3136.0470 3172.5739 3172.7377 3180.7179 3189.5059 3224.2437
redmass: 12.4471 7.4260 12.2788 1.1800 4.8552 12.9803 10.4929 6.0228 10.5814 9.9285 6.0939 7.8516 12.8936 6.6164 6.1659 5.2226 5.3198 8.3608 6.7020 6.8051 13.5398 5.6465 6.4939 4.7724 9.4840 5.7080 4.0516 3.8284 4.7683 7.7063 8.3847 5.6387 3.3396 4.1330 7.4918 6.0643 6.1985 5.8972 7.6118 6.1359 3.4524 6.6361 5.6283 9.2613 5.6697 1.5902 8.3338 1.3553 1.3850 5.1477 1.3390 4.7487 1.1741 6.1528 1.5718 1.3461 1.9848 5.2952 1.5496 2.9667 1.9100 1.9248 2.6444 2.4063 3.0868 1.9350 1.6164 1.2969 2.3712 2.0227 2.2663 2.9705 3.2263 3.9280 9.9640 1.2273 5.3706 2.8235 1.1026 1.1950 1.0468 2.7341 2.6359 8.6972 5.0253 6.8270 5.3985 6.7648 1.0377 1.0590 1.0976 1.1049 1.0989 1.0914 1.0919 1.0918 1.0933 1.0948 1.0795
irintensity: 0.0093 0.7808 0.3022 1.0661 1.2942 2.1643 0.0963 1.1858 1.8324 1.0921 2.4495 0.9734 1.2146 4.7958 4.6441 0.1000 3.7790 12.9793 2.0517 2.3003 1.4093 0.8216 5.1485 0.4038 6.6029 0.5439 0.2954 13.5780 0.2494 16.9477 8.5162 7.9238 16.9572 4.2383 0.2245 1.7277 42.8061 27.9125 5.2675 1.2819 1.3725 22.8565 2.9234 9.6794 16.9157 16.5512 11.8239 43.3046 35.9991 2.8326 1.3274 8.2123 103.9710 33.5563 3.5984 9.5154 18.2389 117.9505 12.4321 5.7724 67.6845 143.6990 63.3858 80.1325 38.1755 57.0986 109.5098 9.3343 25.8210 19.5114 61.3191 203.8044 177.2498 159.2310 6.6179 6.9640 11.2629 272.2676 29.6161 24.2626 14.2071 36.9345 397.1582 3.1916 211.4495 107.2693 94.5993 17.4086 27.1496 16.2650 15.1326 5.8460 12.1869 12.4294 2.9832 0.9914 1.3507 8.7062 115.7630
temp: 298.150 k
press: 1.00000 atm
elementType: 17 17 17 8 8 8 8 7 7 6 6 6 6 6 6 6 6 6 6 6 6 6 6 6 1 1 1 1 1 1 1 1 1 1 1
symmnumber: 1
zpe: 618755.1 jmol-1
zpe.correction: 0.235671 hartree
zpe.thermalcorrener: 0.258413 hartree
zpe.thermalcorrenthalpy: 0.259357 hartree
zpe.thermalcorrgfe: 0.179169 hartree
zpe.sumelectzpe: -2366.980024 hartree
zpe.sumelectthermal: -2366.957282 hartree
zpe.sumelectthermalent: -2366.956338 hartree
zpe.sumelectthermalfe: -2367.036526 hartree
dipole: 3.9686 -1.7726 1.3044
dipole: 4.5380
quadrupole: -137.1273 -169.4386 -160.8201
quadrupole: -12.2786 -6.4454 7.3632
quadrupole: 18.6680 -13.6433 -5.0248 -12.2786 -6.4454 7.3632
hfenergy: -2367.215695 hartree
pointgroup: C01 [X(C15H11Cl3N2O4)]
dipole: -1.4352384 -0.4990963 0.9373284 debye
polarizability: 247.1544831|0.3409404|204.7448977|-19.1500314|-12.9692472|243.2975155 unknown
InChI: InChI=1S/C15H11Cl3N2O4/c1-8-2-3-12(13(4-8)20(22)23)19-15(21)7-24-14-6-10(17)9(16)5-11(14)18/h2-6,19H,7H2,1H3
charge 0 multiplicity 1
35 atoms
Cl 2.660625 -0.454779 -3.43602
Cl 3.287247 1.976198 2.472823
Cl 4.624179 3.514826 -0.121021
O  1.571992 -1.628506 -0.948903
O  -0.609763 -2.337576 1.920797
O  -2.688482 1.664162 -2.800429
O  -0.969219 0.264889 -2.310179
N  -0.962337 -1.070851 -0.052476
N  -2.119472 0.819242 -2.014165
C  -2.203571 -0.452504 0.197707
C  -2.779363 0.465307 -0.746637
C  -4.750002 0.835339 0.679054
C  -4.028682 1.089372 -0.499542
C  -2.944558 -0.701199 1.389589
C  -4.178307 -0.07286 1.61564
C  1.074816 -2.430128 0.174146
C  -0.251953 -1.925695 0.778663
C  -6.085421 1.499427 0.951298
C  2.263437 -0.441469 -0.66897
C  2.839914 0.231563 -1.777805
C  2.411295 0.11212 0.623793
C  3.129299 1.313581 0.79767
C  3.54891 1.429877 -1.601676
C  3.698907 1.974407 -0.307878
H  -4.41044 1.777402 -1.258632
H  -2.524944 -1.392922 2.121914
H  -4.716861 -0.291751 2.545486
H  -0.545394 -0.819883 -0.972671
H  1.819669 -2.521624 0.9852
H  0.904535 -3.430824 -0.258333
H  -6.384887 2.164487 0.124481
H  -6.885077 0.747744 1.087573
H  -6.048396 2.105259 1.875833
H  1.970271 -0.366307 1.501824
H  3.985832 1.940277 -2.463552
