program: Gaussian 09
title: 000295427
version: EM64L-G09RevD.01
frameworkgroup: C1[X(C15H12Cl2N2O4)]
method: RPBEPBE
basis: SDD
operation: Freq
keyword: #p
keyword: freq=noraman
keyword: PBEPBE/SDD
title: #p freq=noraman PBEPBE/SDD
converged: YES YES NO NO
title: Mulliken charges:
elementType: Cl Cl O O O O N N C C C C C C C C C C C C C C C H H H H H H H H H H H H
charge: -0.016127 -0.034562 -0.281876 -0.227178 -0.209393 -0.197484 -0.467765 0.019123 0.373320 0.271579 -0.486176 -0.352471 0.406449 -0.398344 -0.836658 0.166408 -0.457645 0.512692 -0.306006 -0.306720 -0.193421 -0.217106 -0.116069 0.353456 0.386629 0.243860 0.288768 0.240574 0.250063 0.245381 0.250405 0.278167 0.267411 0.285644 0.265070
chargesum: 0.00000
title: Mulliken charges with hydrogens summed into heavy atoms:
elementType: Cl Cl O O O O N N C C C C C C C C C C C C C C C
charge: -0.016127 -0.034562 -0.281876 -0.227178 -0.209393 -0.197484 -0.081136 0.019123 0.373320 0.271579 -0.132719 -0.108610 0.406449 -0.109576 -0.100640 0.166408 0.070927 0.512692 -0.306006 -0.039309 0.092223 0.047964 -0.116069
polarizability: 2.54929233e+02 -1.51784205e+01 1.99041638e+02 1.08723756e+01 -2.05675269e+01 1.95293869e+02
1716.lowfreq: -4.5718 -4.4439 -2.5956 0.0026 0.0028 0.0029 11.9578 17.2925 22.3624
frequency: 11.5853 17.2293 22.2068 46.6160 57.1165 76.1971 87.6304 98.8098 108.1686 163.7666 170.5123 175.1084 177.7145 192.0651 234.2880 241.7862 266.9047 302.5795 319.0985 337.0107 350.2356 366.7761 388.2915 403.2826 428.1607 441.2316 451.0704 491.4542 527.2770 540.4837 547.8374 572.5191 587.7038 615.9384 626.2578 660.8849 684.0425 697.3948 704.7109 721.9888 749.5371 759.2535 792.0509 800.9680 805.2236 840.2311 867.6781 911.3221 935.6229 940.4076 965.8288 976.6701 978.7811 994.8662 1004.0086 1029.5183 1043.1889 1076.4275 1087.0595 1137.4572 1153.0991 1183.7284 1193.6506 1206.3875 1217.2484 1232.1600 1254.8000 1269.1034 1274.5781 1322.9734 1361.2982 1370.0784 1385.8005 1390.9294 1403.0945 1427.1500 1454.8710 1462.7480 1467.5084 1479.4965 1485.5588 1524.9038 1572.7295 1592.8400 1598.7083 1616.7357 1633.0389 2967.0299 3033.2827 3037.6684 3098.6482 3100.5004 3145.0007 3162.4882 3181.9899 3184.0476 3190.5523 3193.4484 3479.8513
redmass: 10.1601 7.1655 9.6089 12.3042 12.1283 7.1400 7.6549 4.7628 4.8256 6.6910 8.9118 1.1252 8.7323 6.6104 5.1303 6.4552 4.9813 4.8774 4.2135 6.6426 7.8697 6.2190 8.4941 5.4226 5.1584 3.5796 3.1187 5.5024 5.2612 4.4722 4.2135 5.5641 4.1007 6.8923 6.9241 5.6690 7.0982 4.0997 5.1304 2.4429 8.1319 1.3695 6.6410 5.8421 1.4253 1.3512 1.3799 6.6099 1.3442 3.9238 1.4070 1.3454 6.4149 1.6548 2.1167 4.0819 1.5626 2.0518 2.4978 1.5578 1.3126 2.5588 2.1789 2.4361 8.4397 1.6696 1.3383 1.9048 1.7363 1.2882 4.9012 9.5182 5.2338 3.9139 1.4051 3.4278 2.3469 1.5375 1.4257 1.0434 1.4120 2.2579 7.4526 7.8228 6.4853 6.0375 6.6016 1.0403 1.0579 1.0974 1.0955 1.1067 1.0907 1.0886 1.0949 1.0954 1.0946 1.0932 1.0758
irintensity: 1.4950 1.2783 1.6190 0.0304 5.2803 0.2225 0.4239 0.3837 1.4930 0.3236 1.6705 0.9848 2.8673 1.7142 0.2314 12.2193 2.2300 7.6391 2.9490 2.6067 2.2417 1.4571 1.5597 11.1582 8.1047 3.0293 6.4427 26.0064 2.3926 2.8906 5.6563 1.3182 6.0385 29.3264 7.5063 5.9210 33.9005 2.2521 6.9041 34.2430 27.0676 75.9420 24.7803 17.7337 51.6803 29.6309 19.9839 12.0025 0.6461 10.3018 28.4878 3.9332 33.2532 14.2689 8.8012 90.1367 6.8053 31.4584 41.2041 6.5432 4.4661 10.3162 81.5947 30.9828 296.4923 91.9306 36.2296 40.9639 8.8524 2.9597 16.3362 101.4304 3.2705 29.8960 11.1844 89.0520 254.8710 100.4798 32.5965 14.0610 55.0926 347.8472 22.7808 10.8382 72.0286 37.0948 125.1167 13.9929 15.8969 13.0119 14.8372 5.7037 12.0258 3.2707 0.0165 1.5557 2.7907 19.2065 67.0859
temp: 298.150 k
press: 1.00000 atm
elementType: 17 17 8 8 8 8 7 7 6 6 6 6 6 6 6 6 6 6 6 6 6 6 6 1 1 1 1 1 1 1 1 1 1 1 1
symmnumber: 1
zpe: 645503.5 jmol-1
zpe.correction: 0.245859 hartree
zpe.thermalcorrener: 0.267190 hartree
zpe.thermalcorrenthalpy: 0.268134 hartree
zpe.thermalcorrgfe: 0.191516 hartree
zpe.sumelectzpe: -1907.593823 hartree
zpe.sumelectthermal: -1907.572492 hartree
zpe.sumelectthermalent: -1907.571548 hartree
zpe.sumelectthermalfe: -1907.648166 hartree
dipole: -5.0259 3.9468 -1.4101
dipole: 6.5441
quadrupole: -190.9128 -147.7173 -141.5553
quadrupole: 19.2368 -11.1195 -2.9871
quadrupole: -30.8510 12.3445 18.5065 19.2368 -11.1195 -2.9871
hfenergy: -1907.839682 hartree
pointgroup: C01[X(C15H12Cl2N2O4)]
dipole: -1.397808 -0.7422202 2.0307795 debye
polarizability: 236.6778141|-4.3343814|178.0166719|-27.0003759|-5.6689286|234.5702543 unknown
InChI: InChI=1S/C15H12Cl2N2O4/c1-9-2-4-11(19(21)22)7-13(9)18-15(20)8-23-14-5-3-10(16)6-12(14)17/h2-7,18H,8H2,1H3
charge 0 multiplicity 1
35 atoms
Cl -2.809377 -2.079266 2.867262
Cl -4.677935 3.049918 1.836874
O  -2.17318 -2.124768 -0.011068
O  0.014285 -1.45316 -2.86794
O  5.845213 0.575117 -2.307422
O  4.107053 0.043715 -3.684187
N  0.424462 -1.565844 -0.539195
N  4.642446 0.150198 -2.515629
C  1.751871 -1.076451 -0.412812
C  2.294442 -0.971782 0.910601
C  2.520169 -0.707724 -1.543061
C  3.617793 -0.495573 1.05709
C  3.830975 -0.238337 -1.332583
C  4.40451 -0.123571 -0.050345
C  1.473509 -1.356889 2.127222
C  -0.342771 -1.715961 -1.68487
C  -1.734568 -2.323072 -1.402788
C  -2.729933 -0.880862 0.3405
C  -3.112735 -0.726081 1.697793
C  -2.930227 0.200331 -0.551288
C  -3.70545 0.459682 2.164032
C  -3.523367 1.400268 -0.099584
C  -3.908591 1.511979 1.247999
H  2.110982 -0.782911 -2.552312
H  -0.056763 -1.834015 0.326489
H  4.037936 -0.413869 2.065269
H  5.426766 0.245439 0.05849
H  1.173412 -2.423442 2.108448
H  2.050084 -1.199697 3.052502
H  0.548517 -0.753125 2.212914
H  -2.458982 -1.927367 -2.134798
H  -1.682401 -3.41908 -1.518033
H  -2.619749 0.131125 -1.597394
H  -3.998471 0.556463 3.2123
H  -3.675121 2.23191 -0.792477
