program: Gaussian 09
title: 000295440
version: EM64L-G09RevD.01
frameworkgroup: C1[X(C18H17Cl2NO4S)]
method: RPBEPBE
basis: SDD
operation: Freq
keyword: #p
keyword: freq=noraman
keyword: PBEPBE/SDD
title: #p freq=noraman PBEPBE/SDD
converged: YES YES NO NO
title: Mulliken charges:
elementType: Cl Cl S O O O O N C C C C C C C C C C C C C C C C C C H H H H H H H H H H H H H H H H H
charge: -0.014880 -0.046544 0.163030 -0.302185 -0.240926 -0.263113 -0.127695 -0.462586 0.464482 0.447408 -0.352067 -0.431574 -0.411780 -0.344471 -0.252714 -0.631502 -0.810004 -0.282519 0.508081 0.250735 -0.146494 -0.292329 -0.295837 -0.202011 -0.223600 -0.106730 0.292795 0.242550 0.229904 0.232439 0.259007 0.236700 0.263270 0.305077 0.352113 0.232712 0.224077 0.227468 0.250612 0.258843 0.257959 0.283080 0.259221
chargesum: 0.00000
title: Mulliken charges with hydrogens summed into heavy atoms:
elementType: Cl Cl S O O O O N C C C C C C C C C C C C C C C C C C
charge: -0.014880 -0.046544 0.163030 -0.302185 -0.240926 -0.263113 -0.127695 -0.110473 0.464482 0.447408 -0.059272 -0.189024 -0.181877 -0.112032 0.242993 -0.063155 -0.125747 0.226936 0.508081 0.250735 -0.146494 -0.292329 -0.037877 0.081069 0.035621 -0.106730
polarizability: 3.52068187e+02 -5.06439882e+01 1.90296376e+02 -1.16951114e+00 -1.14202706e+01 2.12295281e+02
1716.lowfreq: -4.8854 -0.0023 -0.0018 0.0018 3.7946 7.4637 9.6613 20.2171 22.8928
frequency: 6.8934 19.8948 22.8052 28.7237 31.4717 40.9730 51.2173 61.0935 70.1931 83.4958 87.1209 118.0136 128.2175 137.8403 154.5894 161.3936 168.6334 174.0400 205.9184 229.6834 245.8938 283.0592 286.0241 328.9198 330.7942 337.6738 344.7407 368.5935 378.6132 399.7456 409.3812 439.3449 444.3562 455.3978 500.7260 516.0808 529.8647 537.6673 548.8355 615.2190 624.6074 631.4662 654.9663 668.4522 673.7381 701.5384 707.3590 716.9776 752.4769 767.2735 799.5283 810.2840 830.2752 835.3192 847.3856 856.7509 867.6501 902.5757 926.6043 949.6810 953.9692 969.1975 976.9620 980.5918 987.9829 1009.1973 1017.7370 1022.6681 1041.5308 1047.1161 1066.2435 1086.6069 1131.3481 1151.3953 1152.7752 1196.9457 1200.4509 1207.8374 1221.4976 1224.8540 1234.7577 1258.1882 1260.2945 1300.3993 1315.9764 1347.0990 1348.1468 1365.5397 1373.7949 1389.8108 1398.0657 1412.7453 1413.5165 1444.0366 1462.0920 1469.0847 1470.8643 1473.1773 1501.9282 1522.1829 1571.4102 1596.1448 1597.1134 1629.5175 1660.6836 1677.2858 2955.1339 2973.8288 3014.9736 3022.2287 3033.2832 3051.7433 3081.9631 3085.2439 3115.2565 3116.8520 3127.0451 3139.3066 3162.7960 3180.5979 3182.9590 3186.1837 3522.4053
redmass: 7.2427 7.6435 5.5205 2.8424 1.4816 6.7714 4.6456 10.1524 5.5753 9.4664 7.1428 3.3036 6.2270 5.8449 12.2671 5.3015 5.4815 4.6965 9.5585 10.0708 4.3516 2.9900 5.7040 6.0624 4.6259 5.3259 4.3998 11.9217 3.5214 11.9414 2.9659 3.2258 3.3261 6.3894 3.8073 2.5512 5.1552 4.9285 4.1231 5.5309 8.0243 6.6759 2.7623 3.0140 6.0186 3.6882 2.6848 3.1055 4.0571 8.1797 1.4848 3.4483 1.4800 6.8602 1.2663 3.7036 1.3883 3.0692 1.3537 4.5843 1.3656 2.7628 1.3500 1.8149 1.4500 2.9946 3.1324 3.8017 3.8992 1.5422 2.6730 2.5970 1.3209 1.3772 3.1686 1.1148 1.2601 1.0707 1.1439 2.6377 2.9662 1.5067 2.3341 1.1834 1.3425 1.7478 1.3333 2.8416 4.5809 5.1889 1.2477 1.0924 3.3874 1.2358 1.0835 2.0289 1.0626 1.1227 1.9118 2.6795 7.5813 7.6529 4.8336 6.3090 9.9258 8.7319 1.0566 1.0376 1.0568 1.1028 1.0596 1.0970 1.0989 1.1072 1.1066 1.0875 1.0908 1.0971 1.0879 1.0940 1.0963 1.0943 1.0766
irintensity: 0.2532 0.3885 0.5105 1.8569 0.0429 1.2138 0.3081 0.7422 0.2628 4.9908 0.2255 12.2522 6.8228 0.5504 0.6089 1.6091 0.3109 4.9633 0.9728 10.8370 5.6953 1.7912 2.9452 3.1054 11.1237 1.6235 4.9696 7.1861 0.7808 5.5291 0.1258 4.5985 5.5689 8.5336 5.7370 40.1224 0.6849 1.8599 6.6754 12.9299 10.2834 2.1553 14.8153 45.7123 15.3158 0.8942 77.8715 0.7822 1.4204 146.2240 54.2054 0.8566 95.6211 22.5134 2.7928 2.0462 21.2617 25.5693 0.1110 85.7583 19.7058 68.4291 0.9047 6.8924 8.5674 43.2938 39.9235 187.3157 10.6510 14.9914 92.3041 36.3785 36.3632 26.1149 225.5357 4.4584 0.1300 1.9295 11.4610 0.6942 125.4548 75.6160 12.7776 8.9281 24.3885 7.4044 4.0231 11.8523 44.9602 2.4212 12.5263 19.3248 32.8824 140.8177 15.6029 147.1534 20.9118 43.3206 35.5752 456.7622 15.2962 5.6964 26.2290 23.2612 28.9452 348.6088 34.3283 42.8513 37.6825 12.7011 31.0706 21.3252 18.3272 6.5991 2.8604 12.2788 23.7436 6.6735 6.4623 0.0131 3.1424 1.3557 30.1290
temp: 298.150 k
press: 1.00000 atm
elementType: 17 17 16 8 8 8 8 7 6 6 6 6 6 6 6 6 6 6 6 6 6 6 6 6 6 6 1 1 1 1 1 1 1 1 1 1 1 1 1 1 1 1 1
symmnumber: 1
zpe: 824828.9 jmol-1
zpe.correction: 0.314161 hartree
zpe.thermalcorrener: 0.340581 hartree
zpe.thermalcorrenthalpy: 0.341526 hartree
zpe.thermalcorrgfe: 0.251678 hartree
zpe.sumelectzpe: -2368.052029 hartree
zpe.sumelectthermal: -2368.025608 hartree
zpe.sumelectthermalent: -2368.024664 hartree
zpe.sumelectthermalfe: -2368.114512 hartree
dipole: 0.6627 -1.6845 -1.9854
dipole: 2.6867
quadrupole: -165.6183 -170.2312 -172.3125
quadrupole: -16.1971 1.1863 7.4196
quadrupole: 3.7690 -0.8439 -2.9251 -16.1971 1.1863 7.4196
hfenergy: -2368.36619 hartree
pointgroup: C01 [X(C18H17Cl2N1O4S1)]
dipole: 0.5292108 0.3657008 0.8387654 debye
polarizability: 358.6327413|-37.722502|186.9011214|-6.7801084|-14.250451|209.1259807 unknown
InChI: InChI=1S/C18H17Cl2NO4S/c1-12-2-5-14(6-3-12)21-18(23)24-8-9-26-17(22)11-25-16-7-4-13(19)10-15(16)20/h2-7,10,21H,8-9,11H2,1H3
charge 0 multiplicity 1
43 atoms
Cl -1.382531 2.38273 -2.43174
Cl -5.18913 3.763446 1.367607
S  3.799431 0.350509 1.475062
O  3.608837 -1.726525 -0.957899
O  0.346829 1.855481 -0.093371
O  2.583627 -3.140966 0.641873
O  2.890598 1.325013 -0.94669
N  1.358583 -1.852994 -0.933352
C  0.004038 -2.204939 -0.661447
C  -2.756004 -2.801967 -0.217054
C  -0.360779 -3.260221 0.211656
C  -1.008708 -1.445163 -1.304874
C  -1.729043 -3.541236 0.420631
C  -2.365545 -1.745124 -1.081758
C  4.868073 -1.685845 -0.194219
C  5.123966 -0.242363 0.259646
C  -4.222912 -3.127976 0.004907
C  1.320385 1.538148 0.944161
C  -0.914887 2.286531 0.326425
C  2.493947 -2.327729 -0.309561
C  2.628031 1.143158 0.253134
C  -1.855393 2.58693 -0.694656
C  -1.311565 2.440377 1.678067
C  -3.151658 3.035081 -0.391379
C  -2.611223 2.889459 2.001278
C  -3.512042 3.182466 0.963811
H  0.414454 -3.836867 0.72077
H  -0.734508 -0.610921 -1.962492
H  -2.000371 -4.359927 1.098241
H  -3.13288 -1.143377 -1.583978
H  4.808149 -2.39513 0.650681
H  5.663841 -2.002434 -0.891804
H  6.089578 -0.149048 0.783373
H  5.0852 0.449999 -0.598532
H  1.525299 -1.130075 -1.639411
H  -4.679077 -3.567506 -0.903068
H  -4.355355 -3.852855 0.826605
H  -4.806288 -2.222424 0.254837
H  1.514745 2.41833 1.593665
H  0.970196 0.696568 1.574643
H  -0.619855 2.207278 2.492026
H  -3.858194 3.26348 -1.193183
H  -2.910357 3.00413 3.046363
