program: Gaussian 09
title: 000295422
version: EM64L-G09RevD.01
frameworkgroup: C1[X(C17H20Cl2N2O2)]
method: RPBEPBE
basis: SDD
operation: Freq
keyword: #p
keyword: freq=noraman
keyword: PBEPBE/SDD
title: #p freq=noraman PBEPBE/SDD
converged: YES YES NO NO
title: Mulliken charges:
elementType: Cl Cl O O N N C C C C C C C C C C C C C C C C C H H H H H H H H H H H H H H H H H H H H
charge: -0.011984 -0.045850 -0.284265 -0.261360 -0.130554 -0.011178 0.005140 -0.425385 -0.428710 -0.395454 -0.396039 -0.391543 -0.425521 0.224320 -0.413937 -0.521389 -0.144782 0.518748 -0.318278 -0.316313 -0.198807 -0.228457 -0.113379 0.187591 0.253795 0.194296 0.196387 0.252227 0.190183 0.206240 0.189302 0.207303 0.202253 0.201906 0.270431 0.251912 0.292598 0.253460 0.266108 0.254003 0.299368 0.283891 0.261723
chargesum: 0.00000
title: Mulliken charges with hydrogens summed into heavy atoms:
elementType: Cl Cl O O N N C C C C C C C C C C C C C C C C C
charge: -0.011984 -0.045850 -0.284265 -0.261360 -0.130554 -0.011178 0.192731 0.022706 0.019903 0.000969 0.000566 0.012617 0.096822 0.224320 0.132121 -0.001278 -0.144782 0.518748 -0.318278 -0.016945 0.085084 0.033266 -0.113379
polarizability: 2.32220316e+02 9.97665306e+00 2.46872042e+02 2.48110500e+01 -4.03246031e+00 1.64685546e+02
1716.lowfreq: -3.8368 0.0004 0.0008 0.0019 5.4828 6.6494 18.1753 22.1867 33.4056
frequency: 18.1499 21.8177 33.3761 42.1145 53.4780 69.5032 83.8130 101.7319 115.3367 130.1918 149.0730 165.8499 168.7720 178.7205 197.9682 220.7699 225.3420 257.5370 307.9959 322.2622 328.9921 347.8462 356.9946 367.7748 382.6463 398.5620 423.1458 441.2470 454.6521 467.8494 475.2760 486.0228 515.2960 545.1716 547.3484 613.1414 622.2411 677.3509 699.3298 710.9819 747.8246 768.8175 790.3474 794.3510 808.3947 816.8225 845.7798 862.9796 890.2500 898.4368 921.5945 942.9821 943.2649 945.4003 972.2426 993.0195 1012.5864 1025.6289 1027.4335 1045.3206 1057.8540 1072.9801 1078.6192 1087.1475 1109.6845 1129.3996 1156.0352 1177.9497 1192.0894 1198.1418 1212.2024 1235.8527 1248.0843 1259.7198 1262.3704 1264.9508 1279.5585 1284.2120 1305.2245 1319.7454 1330.0435 1334.6624 1335.6555 1343.1408 1344.4827 1356.1065 1358.0845 1361.3547 1386.8066 1429.1617 1445.4372 1464.4637 1465.3635 1466.2043 1471.7854 1472.6266 1475.2973 1487.8111 1489.0461 1570.1669 1581.4786 1593.3029 2200.8140 2963.2538 2964.7735 2968.2116 2977.3741 2990.0532 2993.2980 3007.5613 3014.5813 3028.0591 3031.7572 3034.8522 3043.3949 3067.6337 3072.9479 3075.8630 3096.5356 3113.0360 3147.4559 3177.3072 3182.8171
redmass: 10.9882 6.5141 13.0782 6.0258 3.3764 6.1592 4.5532 6.5796 3.3449 4.6548 4.5873 6.0152 7.6241 9.3161 9.1139 3.1081 2.1113 4.3823 2.3677 6.9808 5.0437 2.5033 7.2385 4.1171 7.3308 3.3412 3.3560 3.3514 2.9445 2.7672 4.5285 5.1708 2.1669 4.6177 4.2003 4.7426 5.5928 6.4815 4.3675 6.0990 3.0890 1.2716 1.4407 6.9629 2.6790 1.4071 1.9251 1.3856 1.8449 1.5712 1.7725 2.8316 1.4758 3.9085 5.2667 2.0840 4.1673 2.4270 4.0828 1.8209 1.1496 1.3833 2.5656 2.3942 2.5653 2.6701 1.3285 2.8241 1.5550 1.5661 1.7861 1.5368 1.2998 1.2977 1.4015 1.3955 1.3357 1.2659 1.3031 1.3033 1.3416 1.3059 1.3711 1.4373 1.4459 1.4186 1.4009 4.3035 5.1275 2.0440 1.1317 2.3888 1.0912 1.0887 1.0885 1.0873 1.0890 1.0907 1.1056 7.5139 6.4474 7.5438 12.4438 1.0646 1.0641 1.0827 1.0619 1.0638 1.0645 1.0619 1.0660 1.0580 1.0976 1.0942 1.1036 1.0991 1.0992 1.0979 1.1074 1.0979 1.0911 1.0955 1.0936
irintensity: 0.0535 0.1705 0.9340 3.2336 1.7254 0.2489 2.7443 0.3198 4.9118 10.6007 1.1482 0.0650 0.5302 4.4292 2.5643 4.5144 2.6241 0.1996 0.6290 4.1316 0.3266 5.2763 1.8995 3.0358 1.9423 1.1121 2.8247 10.1571 4.2754 2.8435 3.2470 4.9222 12.1310 4.4033 6.8542 29.2528 20.0672 19.8556 2.1181 41.2547 13.1824 9.6435 0.4606 21.4915 3.0757 59.2544 7.0948 19.6624 0.9104 18.2029 0.0822 1.9161 4.4599 12.8997 32.2582 13.4615 9.4642 48.4288 65.9397 0.6051 0.9157 0.4774 2.5946 28.6935 0.0668 27.1978 4.1167 20.6098 0.1063 58.0454 54.9087 61.7531 1.1719 1.5065 20.1638 33.8954 10.1750 18.5463 0.5802 14.1963 1.8205 1.1686 0.6483 15.5272 1.9074 31.1933 35.4550 15.6140 3.6094 25.5274 9.8247 229.9320 12.7157 7.8674 15.5068 11.3272 12.8117 17.7385 26.3347 13.0186 235.0091 4.1104 13.8274 25.1264 36.5750 29.1784 29.2791 54.4359 28.4084 13.7400 20.4412 25.4190 58.9548 50.9046 45.0107 2.1544 46.7317 0.5077 9.7482 10.9962 4.0146 1.4542 0.6111
temp: 298.150 k
press: 1.00000 atm
elementType: 17 17 8 8 7 7 6 6 6 6 6 6 6 6 6 6 6 6 6 6 6 6 6 1 1 1 1 1 1 1 1 1 1 1 1 1 1 1 1 1 1 1 1
symmnumber: 1
zpe: 893760.2 jmol-1
zpe.correction: 0.340415 hartree
zpe.thermalcorrener: 0.363141 hartree
zpe.thermalcorrenthalpy: 0.364085 hartree
zpe.thermalcorrgfe: 0.285784 hartree
zpe.sumelectzpe: -1838.139971 hartree
zpe.sumelectthermal: -1838.117245 hartree
zpe.sumelectthermalent: -1838.116301 hartree
zpe.sumelectthermalfe: -1838.194602 hartree
dipole: 3.3416 -2.4831 1.0558
dipole: 4.2949
quadrupole: -147.9448 -177.9696 -149.8691
quadrupole: -0.0477 -2.4122 11.3868
quadrupole: 10.6497 -19.3751 8.7254 -0.0477 -2.4122 11.3868
hfenergy: -1838.4803861 hartree
pointgroup: C01 [X(C17H20Cl2N2O2)]
dipole: 1.0260835 -0.8873242 1.0075118 debye
polarizability: 221.4923498|24.5229544|233.5973875|30.7302794|-23.8211984|188.6881665 unknown
InChI: InChI=1S/C17H20Cl2N2O2/c18-13-7-8-16(15(19)11-13)23-12-17(22)21(10-4-9-20)14-5-2-1-3-6-14/h7-8,11,14H,1-6,10,12H2
charge 0 multiplicity 1
43 atoms
Cl -2.623512 2.725384 -1.906064
Cl -5.070084 -2.262514 -1.911198
O  0.696388 -0.65394 2.212658
O  -1.211931 1.718273 0.483715
N  1.691461 0.742086 0.618404
N  1.760112 4.074556 -3.005615
C  2.812662 -0.224733 0.352311
C  3.718671 -0.442353 1.592352
C  2.311003 -1.571052 -0.23026
C  4.911497 -1.360992 1.229206
C  3.511025 -2.481181 -0.587021
C  4.428495 -2.707467 0.638645
C  1.74295 2.015701 -0.130427
C  0.697961 0.420741 1.525794
C  1.318968 1.840613 -1.622543
C  -0.4669 1.416635 1.721874
C  1.554452 3.069279 -2.396558
C  -2.077559 0.732384 -0.015522
C  -2.835718 1.082626 -1.163669
C  -2.240542 -0.561338 0.540407
C  -3.746217 0.184916 -1.746712
C  -3.153913 -1.47426 -0.032771
C  -3.894668 -1.089974 -1.164142
H  3.434387 0.264067 -0.42768
H  3.117403 -0.9024 2.396074
H  4.083543 0.535439 1.963398
H  1.688094 -1.38393 -1.1271
H  1.671371 -2.069642 0.51889
H  5.564287 -0.851116 0.48979
H  5.528811 -1.536263 2.130775
H  4.102172 -2.018701 -1.405393
H  3.138316 -3.449392 -0.971954
H  3.867318 -3.26589 1.41508
H  5.29706 -3.332141 0.354879
H  1.084715 2.766268 0.330629
H  2.77719 2.405188 -0.086721
H  0.246228 1.583533 -1.666574
H  1.888378 1.013711 -2.086727
H  -1.133599 0.983185 2.4874
H  -0.116704 2.402571 2.070009
H  -1.645696 -0.878479 1.402597
H  -4.321838 0.476502 -2.628491
H  -3.274637 -2.471199 0.399252
