program: Gaussian 09
title: 000295411
version: EM64L-G09RevD.01
frameworkgroup: C1[X(C14H21NO2)]
method: RPBEPBE
basis: SDD
operation: Freq
keyword: #p
keyword: freq=noraman
keyword: PBEPBE/SDD
title: #p freq=noraman PBEPBE/SDD
converged: YES YES NO NO
title: Mulliken charges:
elementType: O O N C C C C C C C C C C C C C C H H H H H H H H H H H H H H H H H H H H H
charge: -0.454157 -0.296560 -0.179852 -0.470639 -0.052535 -0.394102 -0.278412 0.429427 -0.671457 -0.386997 -0.383674 -0.237632 -0.237239 -0.287210 -0.272783 -0.061040 -0.559540 0.227613 0.257203 0.193607 0.222426 0.222473 0.222040 0.191799 0.214605 0.240598 0.222146 0.257629 0.228106 0.363729 0.219770 0.218077 0.199087 0.194918 0.225518 0.233794 0.218279 0.220985
chargesum: 0.00000
title: Mulliken charges with hydrogens summed into heavy atoms:
elementType: O O N C C C C C C C C C C C C C C
charge: -0.090428 -0.296560 -0.179852 0.014177 0.141072 0.050796 0.135428 0.429427 0.005892 -0.129367 -0.155568 -0.017862 -0.019162 0.106794 -0.047265 0.172754 -0.120276
polarizability: 2.26403679e+02 1.88312349e+01 1.59247994e+02 -7.41185108e-01 1.29530833e+01 1.19536362e+02
1716.lowfreq: -7.3006 -0.0010 -0.0008 0.0002 5.0327 6.8171 14.3562 29.9967 46.1060
frequency: 13.1969 29.9449 46.0936 52.0036 77.2471 79.7825 90.5009 102.6055 121.9763 138.8190 182.4111 198.9465 213.0069 220.0484 291.7239 296.1219 359.5211 366.5192 384.9610 402.9664 424.8968 449.2221 456.9881 489.3446 509.2870 524.7681 595.5282 615.0444 636.6192 695.7785 728.3932 749.8668 794.3763 816.1415 833.1001 871.0681 876.2600 903.8468 928.7197 939.0784 953.0839 955.3287 972.2037 973.6173 975.9008 996.7308 1009.6300 1029.1531 1034.8467 1049.2911 1070.3081 1081.0619 1093.1630 1100.1431 1128.6812 1149.1524 1171.8297 1174.4509 1194.1158 1206.6958 1207.5515 1233.8801 1240.0489 1279.1780 1279.9203 1306.6283 1314.4380 1335.8774 1342.6399 1350.0305 1374.9083 1377.7304 1387.8623 1389.2060 1408.2752 1434.6135 1449.5272 1467.4491 1468.6499 1472.7475 1482.8888 1484.4658 1494.5471 1504.2053 1575.5028 1619.3297 1665.5138 2907.4436 2936.9895 2954.2564 2971.5066 2983.8668 2993.6369 2998.8849 3002.7092 3042.0143 3063.7610 3078.0758 3090.9151 3093.1202 3118.6737 3120.9895 3127.6113 3153.9938 3160.6689 3170.5429 3200.9143 3544.9836
redmass: 4.4917 4.3018 3.2379 2.4361 3.5402 3.9726 4.4316 3.1441 2.8889 2.9041 2.2498 3.7116 1.4173 3.2955 3.0194 3.9754 2.3488 3.2753 2.7609 1.6931 1.7796 2.4148 2.9267 2.6934 2.6665 2.5711 3.5307 6.3085 1.6745 1.8813 3.9445 1.8188 1.1849 1.2891 2.5195 1.4489 2.1569 2.1302 1.9356 2.4831 1.3583 1.3890 1.9644 1.5946 2.3981 2.8341 1.2793 2.4989 2.2961 2.8588 2.6857 2.0714 1.7272 2.1817 1.7433 1.6953 1.1898 1.3751 1.7035 1.1391 1.2345 1.2097 1.5063 1.2577 1.2674 1.2187 1.2193 1.3739 1.3018 1.2830 1.5309 3.8055 1.5277 1.4576 1.6786 1.2380 2.3762 1.0965 1.0455 1.1193 1.0770 1.0608 1.6004 1.4619 5.9128 5.9662 4.8251 1.0591 1.0580 1.0822 1.1004 1.0358 1.0622 1.0953 1.0687 1.1024 1.1030 1.0997 1.0604 1.1007 1.0945 1.0847 1.0891 1.0921 1.0936 1.0988 1.1143 1.0658
irintensity: 0.0816 0.2910 0.6266 1.3603 0.4272 2.2742 2.2294 1.0755 0.8250 9.0050 0.6728 0.2571 0.6776 1.3538 2.2156 10.8390 6.2836 0.4301 6.2554 137.8059 75.5612 18.2920 4.1924 2.2835 7.1918 3.4151 7.0845 0.1786 5.1600 26.5028 6.1767 80.7937 12.5058 2.0455 8.8409 3.4908 2.5387 15.2028 5.4004 22.7813 89.4135 0.1112 5.4016 1.6097 2.3498 52.4779 39.8212 127.1411 20.4258 38.1590 37.3676 52.4256 3.5325 16.0753 19.9412 1.9421 3.9172 23.0565 35.0698 8.8960 6.5934 16.3735 41.4826 6.0395 12.3611 19.4691 16.5514 0.7110 21.6874 13.3822 14.5701 10.8396 33.9525 50.4667 4.5947 21.1519 1.9736 5.7345 8.5057 12.3295 8.8816 6.4812 92.6983 99.9636 10.9848 192.3098 3.3112 59.7208 42.5933 41.9140 51.9799 25.1853 30.3167 71.1682 27.4248 11.7349 17.3365 43.7003 11.0875 40.7110 8.5302 7.2253 15.0260 32.5161 31.4340 6.1897 26.2979 11.7709
temp: 298.150 k
press: 1.00000 atm
elementType: 8 8 7 6 6 6 6 6 6 6 6 6 6 6 6 6 6 1 1 1 1 1 1 1 1 1 1 1 1 1 1 1 1 1 1 1 1 1
symmnumber: 1
zpe: 846293.9 jmol-1
zpe.correction: 0.322336 hartree
zpe.thermalcorrener: 0.340964 hartree
zpe.thermalcorrenthalpy: 0.341908 hartree
zpe.thermalcorrgfe: 0.272965 hartree
zpe.sumelectzpe: -749.911202 hartree
zpe.sumelectthermal: -749.892574 hartree
zpe.sumelectthermalent: -749.891630 hartree
zpe.sumelectthermalfe: -749.960573 hartree
dipole: 1.9522 1.3913 -0.0307
dipole: 2.3974
quadrupole: -96.5994 -101.0330 -104.4195
quadrupole: -3.8795 -3.4425 7.0078
quadrupole: 4.0846 -0.3490 -3.7355 -3.8795 -3.4425 7.0078
hfenergy: -750.233538 hartree
pointgroup: C01 [X(C14H21N1O2)]
dipole: 0.7702128 -0.5443561 -0.0110339 debye
polarizability: 226.551921|-18.548439|158.0075389|-0.2510303|14.5217423|120.6285756 unknown
InChI: InChI=1S/C14H21NO2/c1-3-10-17-12-14(16)11-15(4-2)13-8-6-5-7-9-13/h3,5-9,14,16H,1,4,10-12H2,2H3
charge 0 multiplicity 1
38 atoms
O  0.039255 1.993957 -1.237543
O  3.126926 0.279484 -0.250348
N  -1.03714 -0.688805 -0.341526
C  0.230386 -0.093038 0.126513
C  0.882399 0.829206 -0.929884
C  -0.912542 -1.995549 -1.020927
C  2.213319 1.412022 -0.445191
C  -2.296402 -0.198683 0.071404
C  -0.911177 -3.208937 -0.059209
C  -2.430854 1.082963 0.698614
C  -3.493929 -0.952697 -0.14478
C  -3.694554 1.566399 1.092855
C  -4.750941 -0.446582 0.243866
C  4.455948 0.7124 0.216282
C  -4.870981 0.814231 0.871209
C  5.354452 -0.496181 0.251044
C  6.129827 -0.843856 1.30697
H  0.063871 0.476169 1.058579
H  0.952095 -0.897317 0.362514
H  1.0700 0.23582 -1.851618
H  -1.720915 -2.097381 -1.768491
H  0.034405 -1.985596 -1.592913
H  2.610379 2.115823 -1.206883
H  2.064064 1.969589 0.505711
H  -0.810864 -4.152359 -0.627497
H  -1.843343 -3.254546 0.529797
H  -0.065052 -3.147559 0.649028
H  -1.554246 1.71636 0.861283
H  -3.451049 -1.941937 -0.608811
H  -0.871759 1.666557 -1.454822
H  -3.756946 2.552884 1.567595
H  -5.645165 -1.054175 0.060257
H  4.380885 1.18538 1.219356
H  4.856818 1.472768 -0.494151
H  -5.849484 1.19964 1.174971
H  5.365183 -1.095073 -0.670068
H  6.125551 -0.267668 2.240751
H  6.793477 -1.714514 1.268463
