program: Gaussian 09
title: 000295419
version: EM64L-G09RevD.01
frameworkgroup: C1[X(C14H29NO2)]
method: RPBEPBE
basis: SDD
operation: Freq
keyword: #p
keyword: freq=noraman
keyword: PBEPBE/SDD
title: #p freq=noraman PBEPBE/SDD
converged: YES YES NO NO
title: Mulliken charges:
elementType: O O N C C C C C C C C C C C C C C H H H H H H H H H H H H H H H H H H H H H H H H H H H H H
charge: -0.464495 -0.304140 -0.125887 -0.345617 -0.367749 -0.413269 -0.047626 -0.050447 -0.065017 -0.698453 -0.703073 -0.697180 -0.708082 -0.302551 -0.296355 -0.058802 -0.558071 0.192144 0.182193 0.195732 0.190841 0.210503 0.230981 0.196165 0.213155 0.212262 0.189203 0.208990 0.237854 0.202605 0.216594 0.212689 0.195305 0.209857 0.229966 0.201898 0.217431 0.212357 0.186858 0.233742 0.358095 0.195548 0.198590 0.235643 0.221540 0.218075
chargesum: 0.00000
title: Mulliken charges with hydrogens summed into heavy atoms:
elementType: O O N C C C C C C C C C C C C C C
charge: -0.106400 -0.304140 -0.125887 0.028720 0.018823 0.028215 0.148539 0.162708 0.147245 -0.062405 -0.071185 -0.062053 -0.076397 0.118048 0.097784 0.176840 -0.118457
polarizability: 2.04290776e+02 2.20163256e+00 1.63081535e+02 -4.08192988e-01 -2.91511725e+00 1.43221024e+02
1716.lowfreq: -6.3236 -3.4837 -0.0006 -0.0005 -0.0004 6.1810 17.6829 28.6425 35.8243
frequency: 16.7024 28.3774 35.6635 55.0844 62.9730 65.7339 74.5375 76.8349 95.7178 101.4189 141.8335 145.4387 176.0660 202.1835 205.9897 209.8581 239.4321 245.9761 258.3426 280.9381 287.9889 312.9054 326.7295 369.0580 387.0892 399.5525 415.3562 416.8525 437.3739 452.5481 495.1350 505.6138 531.8162 559.9458 639.5336 810.6010 814.1043 837.3013 848.9949 883.4694 902.6889 908.2778 909.1587 918.1067 922.2589 937.6491 945.5932 954.4027 956.2911 958.1585 961.0379 973.9467 1009.3785 1032.3086 1038.6619 1054.4022 1075.5579 1096.3818 1114.0656 1130.5663 1139.4376 1146.6169 1168.5524 1180.9100 1182.5840 1197.6822 1203.8178 1214.0584 1233.9438 1254.6209 1268.7915 1279.4227 1287.4076 1300.1522 1309.1091 1314.1318 1314.6023 1338.4531 1342.7023 1352.6118 1363.4678 1366.3079 1369.5169 1372.7216 1380.3408 1392.8689 1396.6343 1397.4301 1433.2726 1457.8716 1460.6719 1462.9020 1467.2407 1468.0566 1471.3397 1473.4745 1475.4612 1476.7005 1479.4873 1480.5609 1488.3226 1493.4319 1665.3266 2837.9904 2847.3006 2913.0932 2932.0371 2956.6343 2965.9496 2966.6771 2968.4291 2970.0019 2971.5948 2972.6726 2973.9091 2975.6531 3006.9011 3018.4986 3022.5258 3025.2838 3056.3203 3057.1297 3063.2531 3064.8500 3071.5423 3072.1626 3080.6922 3084.0954 3090.8248 3119.0663 3200.7973 3515.1342
redmass: 4.0365 4.0836 2.3532 2.4734 3.2360 3.3976 3.4318 2.7520 3.1751 3.0109 3.3620 3.0499 2.8028 1.2188 1.1146 1.4447 1.2162 1.6918 1.8270 2.4298 2.8450 2.9266 2.4073 2.9072 2.2097 2.3565 2.2483 2.2580 2.0618 1.8231 1.4007 2.0115 2.5630 3.6007 1.6890 2.8143 2.5265 2.6222 2.9991 2.1611 1.5085 1.7081 1.4875 1.2235 1.2353 1.9894 1.8052 1.3489 1.6485 1.5212 1.6733 1.7454 1.2468 2.4547 6.2713 2.1275 2.5842 2.3656 1.9375 2.2504 2.2152 1.6075 1.5367 1.8406 1.9040 1.8349 1.8412 1.3269 1.2594 1.2037 1.1980 1.2429 1.2840 1.2182 1.4481 1.4065 1.2086 1.4210 1.3599 1.3063 1.3511 1.3164 1.2454 1.2434 1.3330 1.2280 1.3819 1.4955 1.2018 1.0916 1.0735 1.0710 1.0472 1.0552 1.0721 1.0757 1.0719 1.0744 1.0495 1.0492 1.0577 1.0544 4.7993 1.0706 1.0699 1.0586 1.0609 1.0602 1.0383 1.0359 1.0379 1.0400 1.0800 1.0794 1.0788 1.1006 1.0919 1.0987 1.0935 1.0965 1.0983 1.0991 1.0984 1.0985 1.0990 1.0990 1.0988 1.0986 1.0604 1.0945 1.1143 1.0650
irintensity: 0.4946 0.5397 1.4792 0.1404 0.1470 0.1092 0.5465 0.1237 0.5852 0.1400 4.4347 3.3108 1.4725 0.6281 0.4130 1.2193 2.0643 2.8017 3.6812 1.5477 1.5624 3.0907 2.0889 2.6694 1.2642 1.0679 1.8526 2.4377 1.1201 9.7831 104.9802 41.6198 9.0968 4.2630 6.6767 9.4115 1.7853 3.3502 23.0031 8.2269 4.0505 13.9949 0.1515 8.0577 5.8544 12.7237 10.1302 85.7285 1.3278 4.3222 1.2462 0.5985 51.1501 86.8642 218.1772 23.1252 8.5867 39.5232 18.1168 5.0226 2.0070 0.1299 14.6948 4.4399 5.2043 3.2141 7.9422 4.7172 30.5624 20.0662 7.7071 0.1804 5.8487 11.3823 2.3590 3.8147 17.0401 1.2804 1.1964 4.9315 13.6963 0.8096 7.5075 22.8730 8.6227 31.6104 27.0218 1.9291 25.6568 5.3832 2.3132 0.8509 1.0324 3.1579 4.8984 10.5598 9.6887 9.7642 12.2287 5.0684 16.8928 30.6881 3.5014 42.1310 187.6585 43.1418 49.7572 29.1061 25.4481 49.7296 32.6917 25.8609 49.1757 16.0736 7.3219 60.8898 10.7295 22.5192 96.6879 34.1188 18.7063 8.0441 57.6505 107.5465 51.6543 50.1251 55.7946 26.2514 10.9521 8.0749 26.3367 23.9189
temp: 298.150 k
press: 1.00000 atm
elementType: 8 8 7 6 6 6 6 6 6 6 6 6 6 6 6 6 6 1 1 1 1 1 1 1 1 1 1 1 1 1 1 1 1 1 1 1 1 1 1 1 1 1 1 1 1 1
symmnumber: 1
zpe: 1072894.8 jmol-1
zpe.correction: 0.408644 hartree
zpe.thermalcorrener: 0.430936 hartree
zpe.thermalcorrenthalpy: 0.431880 hartree
zpe.thermalcorrgfe: 0.355217 hartree
zpe.sumelectzpe: -754.597787 hartree
zpe.sumelectthermal: -754.575495 hartree
zpe.sumelectthermalent: -754.574551 hartree
zpe.sumelectthermalfe: -754.651214 hartree
dipole: -0.1799 2.3896 0.8961
dipole: 2.5584
quadrupole: -98.4734 -110.1008 -112.6762
quadrupole: 4.1026 1.9507 -5.4488
quadrupole: 8.6101 -3.0174 -5.5927 4.1026 1.9507 -5.4488
hfenergy: -755.0064311 hartree
pointgroup: C01 [X(C14H29N1O2)]
dipole: 0.0343187 -0.9954996 0.1447064 debye
polarizability: 203.7558153|0.5108691|160.92108|-6.1973025|6.6567501|145.9164401 unknown
InChI: InChI=1S/C14H29NO2/c1-6-7-17-11-14(16)10-15(8-12(2)3)9-13(4)5/h6,12-14,16H,1,7-11H2,2-5H3
charge 0 multiplicity 1
46 atoms
O  -1.448393 2.390867 -1.322937
O  -2.71902 0.661527 0.418406
N  1.52897 0.149036 -0.826615
C  1.694503 -1.163519 -1.505374
C  2.816525 0.820724 -0.517741
C  0.546514 1.050283 -1.486248
C  2.212771 -2.309058 -0.594899
C  2.727187 1.883515 0.608764
C  -0.674343 1.367918 -0.601862
C  1.2312 -2.610925 0.558245
C  2.47827 -3.569466 -1.451899
C  2.342547 1.242851 1.960895
C  4.067837 2.647832 0.712271
C  -1.560381 0.147604 -0.33636
C  -3.748439 -0.366959 0.651387
C  -4.820201 0.232318 1.523965
C  -6.14676 0.179785 1.250792
H  0.703739 -1.468718 -1.896447
H  2.376396 -1.080896 -2.391368
H  3.545426 0.050432 -0.200731
H  3.2409 1.307556 -1.434126
H  0.181648 0.61375 -2.438668
H  1.013808 2.020528 -1.750826
H  3.178524 -1.99384 -0.148659
H  1.939393 2.614979 0.332841
H  -0.331562 1.769365 0.375096
H  0.271462 -2.998061 0.161151
H  1.643813 -3.373785 1.244504
H  1.023645 -1.693529 1.136401
H  1.544166 -3.92343 -1.93039
H  2.869699 -4.395414 -0.830177
H  3.213982 -3.368079 -2.253493
H  3.148222 0.570987 2.317113
H  2.176847 2.013809 2.736189
H  1.420536 0.643765 1.857731
H  4.896379 1.956133 0.961205
H  4.023384 3.416656 1.505269
H  4.321714 3.153551 -0.238636
H  -1.906135 -0.293946 -1.297917
H  -1.014002 -0.616211 0.25216
H  -2.331847 2.44044 -0.869386
H  -3.274158 -1.236417 1.162486
H  -4.168057 -0.721802 -0.314728
H  -4.457786 0.7196 2.439508
H  -6.889807 0.603538 1.935116
H  -6.529415 -0.289288 0.335589
