program: Gaussian 09
title: 000295407
version: EM64L-G09RevD.01
frameworkgroup: C1[X(C14H11Cl3N2O)]
method: RPBEPBE
basis: SDD
operation: Freq
keyword: #p
keyword: freq=noraman
keyword: PBEPBE/SDD
title: #p freq=noraman PBEPBE/SDD
converged: YES YES NO NO
title: Mulliken charges:
elementType: Cl Cl Cl O N N C C C C C C C C C C C C C C H H H H H H H H H H H
charge: -0.063226 -0.015954 -0.009806 -0.280751 -0.505801 -0.511587 0.504023 0.535181 -0.467992 -0.343995 -0.247515 -0.395868 0.526602 0.279450 -0.797413 -0.458513 -0.336574 -0.027651 -0.179194 -0.123417 0.245313 0.308750 0.236352 0.295402 0.296763 0.244921 0.244919 0.224955 0.248740 0.316014 0.257870
chargesum: 0.00000
title: Mulliken charges with hydrogens summed into heavy atoms:
elementType: Cl Cl Cl O N N C C C C C C C C C C C C C C
charge: -0.063226 -0.015954 -0.009806 -0.280751 -0.210400 -0.214824 0.504023 0.535181 -0.222679 -0.035245 -0.247515 -0.159516 0.526602 0.279450 -0.082618 -0.209772 -0.020559 -0.027651 0.078676 -0.123417
polarizability: 3.90429687e+02 -4.47229132e-01 1.99637607e+02 -3.87088646e-03 -1.68468633e-02 7.81433936e+01
1716.lowfreq: 0.0010 0.0013 0.0019 1.6893 4.8673 11.4612 18.4986 22.8995 47.1592
frequency: 18.0988 22.5809 47.1582 58.9166 68.9845 113.4469 116.8492 136.5941 141.5171 152.3158 185.7527 187.9511 188.2376 228.5873 258.3291 299.7626 309.2719 327.2926 358.2774 396.0248 432.5156 436.0011 439.0555 447.0639 453.8451 459.1718 539.4552 574.5655 586.8612 618.6866 648.4413 662.5305 687.3737 694.1030 696.5225 700.5703 771.1222 780.7562 834.0369 841.7332 855.4111 857.7767 858.6988 897.1578 976.5954 981.0745 995.2974 998.0020 1017.7684 1028.8691 1046.4533 1122.8554 1146.4166 1158.0028 1178.9676 1215.4198 1239.5940 1259.1711 1281.9342 1299.5916 1342.2197 1355.9586 1395.3138 1401.6004 1406.2427 1463.2467 1465.0869 1468.5464 1490.7761 1504.9331 1512.9447 1580.3373 1586.9323 1606.7305 1626.0169 1654.2564 2984.5500 3062.7861 3095.5602 3135.6226 3138.8575 3140.1362 3167.3273 3202.6977 3204.6872 3520.9872 3533.4247
redmass: 9.5638 6.3575 9.4407 5.6770 8.8356 1.7380 2.1345 10.6223 2.4756 11.0850 5.7868 19.4033 4.2814 6.5898 5.5720 10.8955 3.3820 4.0233 9.2122 8.2119 5.8932 2.5191 3.0322 8.7109 4.3158 1.8858 7.4469 3.4507 4.2015 1.3485 7.0501 7.5113 3.1846 7.2163 5.2927 3.7129 5.3838 6.9380 1.3282 1.2953 1.6298 1.6229 6.8529 5.8217 1.3071 1.3139 5.4929 1.4646 6.2016 2.9558 1.5098 2.2104 1.3508 1.2971 2.5791 1.6931 1.5344 2.1780 1.7664 2.2568 3.6325 4.4447 5.4614 2.0454 1.8611 1.0445 1.4762 2.1770 2.1981 2.2493 2.5454 4.5084 4.7516 6.5997 7.0277 3.9001 1.0371 1.0974 1.0994 1.0921 1.0913 1.0923 1.0911 1.0943 1.0950 1.0768 1.0758
irintensity: 0.1825 0.1520 0.3058 0.0304 13.9587 1.0396 0.1662 5.5266 0.4744 1.1364 3.7726 0.5699 0.3075 1.4320 3.5370 4.9972 0.0590 0.7641 4.3377 3.2611 7.1664 0.7214 14.2553 32.5103 7.5420 0.0418 0.2695 54.6282 3.9425 103.5008 10.4678 8.0702 9.6140 29.3823 25.6013 0.1290 5.9722 0.3088 9.5685 3.5220 0.0248 148.6759 15.4859 16.1140 2.0837 6.7057 33.6956 24.7918 27.2087 31.0589 8.1673 92.7480 3.1096 3.3670 424.6193 35.7180 53.2935 36.2259 92.6725 18.2306 35.8001 385.0385 5.3680 39.1651 2.0836 14.3959 233.7759 213.7023 208.8020 790.7101 235.8850 194.9704 86.1213 85.9899 68.3445 98.2338 29.4688 14.9617 15.9838 14.2163 7.5946 6.2761 1.3059 9.0666 10.9963 6.3695 18.7758
temp: 298.150 k
press: 1.00000 atm
elementType: 17 17 17 8 7 7 6 6 6 6 6 6 6 6 6 6 6 6 6 6 1 1 1 1 1 1 1 1 1 1 1
symmnumber: 1
zpe: 576499.5 jmol-1
zpe.correction: 0.219577 hartree
zpe.thermalcorrener: 0.238716 hartree
zpe.thermalcorrenthalpy: 0.239661 hartree
zpe.thermalcorrgfe: 0.169147 hartree
zpe.sumelectzpe: -2103.609079 hartree
zpe.sumelectthermal: -2103.589939 hartree
zpe.sumelectthermalent: -2103.588995 hartree
zpe.sumelectthermalfe: -2103.659509 hartree
dipole: -2.6635 1.6398 -0.0011
dipole: 3.1278
quadrupole: -160.6812 -127.2024 -142.2083
quadrupole: 5.5675 -0.0028 -0.0050
quadrupole: -17.3173 16.1616 1.1557 5.5675 -0.0028 -0.0050
hfenergy: -2103.8286557 hartree
pointgroup: C01 [X(C14H11Cl3N2O1)]
dipole: -1.038344 -0.6603887 0.0004287 debye
polarizability: 390.3758852|3.2345107|199.6914087|0.0041166|-0.0167885|78.1433936 unknown
InChI: InChI=1S/C14H11Cl3N2O/c1-8-2-3-9(6-12(8)16)18-14(20)19-10-4-5-11(15)13(17)7-10/h2-7,18-19H,1H3
charge 0 multiplicity 1
31 atoms
Cl -6.135819 -2.095717 -0.000122
Cl 6.120792 -2.178746 0.000062
Cl 7.006119 1.004464 -0.000451
O  0.018506 1.401835 0.000162
N  -1.161106 -0.640185 0.000611
N  1.171496 -0.65777 0.000644
C  -2.507811 -0.17743 0.000259
C  -5.286863 0.58213 -0.000408
C  -3.526331 -1.167538 0.000223
C  -2.873773 1.193392 -0.000037
C  -4.872389 -0.77077 -0.000101
C  -4.239985 1.540599 -0.000362
C  2.519568 -0.211997 0.000367
C  0.007281 0.137956 0.000664
C  -6.74405 0.992467 -0.000769
C  3.527256 -1.213713 0.000331
C  2.898384 1.158047 0.000145
C  4.885938 -0.85242 0.000087
C  4.264927 1.498453 -0.000104
C  5.265874 0.505311 -0.000133
H  -3.275627 -2.234283 0.000446
H  -2.097118 1.958821 -0.000006
H  -4.511353 2.602485 -0.000589
H  -1.060917 -1.657461 0.00081
H  1.056819 -1.673436 0.000788
H  -7.27355 0.597928 -0.88741
H  -7.27394 0.598107 0.885719
H  -6.840793 2.090792 -0.000904
H  3.263256 -2.27714 0.000495
H  2.129627 1.931098 0.000166
H  4.561884 2.551221 -0.000276
