program: Gaussian 09
title: 000295441
version: EM64L-G09RevD.01
frameworkgroup: C1[X(C20H24N2O4S)]
method: RPBEPBE
basis: SDD
operation: Freq
keyword: #p
keyword: freq=noraman
keyword: PBEPBE/SDD
title: #p freq=noraman PBEPBE/SDD
converged: YES YES NO NO
title: Mulliken charges:
elementType: S O O O O N N C C C C C C C C C C C C C C C C C C C C H H H H H H H H H H H H H H H H H H H H H H H H
charge: 0.175347 -0.299861 -0.299348 -0.278971 -0.290384 -0.471325 -0.446344 -0.659077 -0.647036 -0.226756 -0.267027 0.456139 0.474374 0.451735 0.432897 -0.359146 -0.371981 -0.417048 -0.442739 -0.353000 -0.355955 -0.424648 -0.398398 -0.812417 -0.817783 0.264058 0.290367 0.312263 0.242093 0.264048 0.247007 0.240683 0.235858 0.232110 0.253302 0.297173 0.306792 0.240158 0.224456 0.227717 0.239721 0.228109 0.233613 0.359718 0.331631 0.230585 0.220602 0.228673 0.240508 0.221220 0.236288
chargesum: 0.00000
title: Mulliken charges with hydrogens summed into heavy atoms:
elementType: S O O O O N N C C C C C C C C C C C C C C C C C C C C
charge: 0.175347 -0.299861 -0.299348 -0.278971 -0.290384 -0.111608 -0.114713 -0.104721 -0.135981 0.249785 0.218385 0.456139 0.474374 0.451735 0.432897 -0.061974 -0.065188 -0.176891 -0.218283 -0.125284 -0.116234 -0.196539 -0.164784 -0.132557 -0.119766 0.264058 0.290367
polarizability: 3.88278849e+02 3.80522411e+01 2.48615807e+02 4.95571002e+00 -3.02184564e+01 1.76949580e+02
1716.lowfreq: -26.9151 -3.7443 -2.1494 0.0013 0.0018 0.0019 5.4584 8.0250 22.0145
frequency: -26.7247 7.1436 22.0012 26.2017 31.5236 47.2932 50.3313 57.4268 69.0790 71.0979 76.2862 83.2328 108.6029 123.2785 131.1152 141.1641 160.1591 181.6617 187.8181 209.4386 236.6696 256.2244 279.8574 286.2311 297.1147 321.9182 341.4422 342.1202 346.7064 376.6292 379.2869 407.4030 411.4436 434.1999 478.0649 513.3901 515.4236 532.1492 541.8360 609.1820 627.8372 633.6356 633.7954 638.8079 664.4179 674.7469 691.3037 705.8221 709.1323 712.9207 717.3773 751.9102 752.2184 804.3681 815.8298 822.0080 825.7390 850.8843 851.4070 855.8075 861.1698 899.6844 938.2730 943.3470 945.3661 970.3732 979.1357 983.2166 983.6717 987.0764 989.9559 1006.7311 1008.0751 1015.3382 1017.3722 1046.6842 1048.8327 1060.3619 1076.7196 1129.7177 1130.9205 1159.0819 1165.0888 1185.8514 1191.9691 1195.6618 1196.6054 1219.0848 1223.4065 1224.4803 1227.2999 1263.2492 1265.0737 1296.4218 1302.4356 1316.5222 1317.1697 1354.6781 1356.2077 1370.9774 1373.8101 1397.0858 1399.6164 1412.0324 1414.7424 1424.2901 1443.3446 1465.4177 1469.7109 1470.2477 1470.5991 1474.8232 1475.9151 1504.9798 1508.2124 1519.2603 1523.9362 1593.4203 1596.4567 1628.4176 1630.5948 1661.9821 1666.3254 2973.5014 2974.5609 2998.9075 3009.8133 3015.3909 3024.4856 3050.6032 3051.8579 3065.1109 3079.8740 3080.6468 3082.2756 3096.8680 3099.6342 3114.0556 3114.5362 3121.8053 3125.0535 3137.0455 3140.6711 3185.1184 3185.2324 3506.4052 3543.9491
redmass: 1.0340 5.0849 5.2884 4.5099 5.3725 5.0829 5.0946 5.4068 4.9017 4.1765 4.3522 1.2455 7.0228 5.8692 4.8792 4.0392 4.4009 4.6137 3.7592 3.9125 2.6720 4.5422 3.4489 5.4885 4.5797 3.7367 3.8817 3.9728 3.3246 3.6308 3.8698 2.9504 2.9738 3.5127 3.5381 2.4898 2.5229 5.3756 4.3073 3.9117 5.6096 6.8047 1.5303 4.5342 1.7600 5.4521 4.3859 2.7093 5.5286 3.0501 3.0710 3.8314 4.0849 2.9108 4.0620 1.4578 1.4657 2.2759 1.5254 1.3345 3.5519 3.6757 2.5670 1.3475 1.3461 3.1390 2.1085 1.3281 1.3256 1.4726 1.4359 2.7454 2.8379 2.4703 2.5642 1.5349 1.5273 2.9611 2.5455 1.3199 1.3068 3.2714 3.3485 1.2442 1.2172 1.1184 1.1138 1.2232 2.6109 2.5752 1.1883 2.3021 2.3737 1.1852 1.2056 1.3638 1.3621 1.3985 1.5788 3.6446 3.2321 1.2376 1.2378 3.5072 3.4765 1.0867 1.0997 1.0883 1.0507 1.0695 1.0870 1.1023 1.1346 1.9147 1.9733 2.7841 2.7113 4.7597 4.6983 6.2830 6.2672 8.6173 8.1315 1.0371 1.0371 1.0570 1.0588 1.0587 1.0588 1.0976 1.0975 1.1066 1.0986 1.0989 1.1059 1.1072 1.1053 1.0874 1.0876 1.0906 1.0908 1.0968 1.0965 1.0941 1.0942 1.0769 1.0760
irintensity: 0.2538 0.0116 0.0216 1.0816 0.9695 1.8500 0.4185 0.4167 1.4406 0.2998 2.0944 0.1832 3.3524 8.2802 1.6714 0.7379 2.3161 5.8078 3.4686 6.6150 4.3542 8.5360 0.8374 3.7300 7.3279 1.2612 1.1951 1.3397 18.9760 1.7992 1.3769 0.0164 0.1791 2.9463 20.7687 63.1947 12.8291 2.1400 0.9070 2.0710 1.7129 2.0397 19.3364 3.2119 9.7678 20.4940 65.1654 61.1676 12.2833 0.9180 0.9624 0.2008 0.5330 1.3362 0.9053 30.3243 106.9027 3.6229 13.8992 22.1475 4.6927 7.3548 20.7563 5.7282 2.6112 43.6914 49.2044 4.3532 1.2327 0.0924 0.3703 105.8156 0.4091 90.3839 8.6704 8.3880 18.9656 161.2378 76.7580 16.5999 62.4682 40.9272 638.6246 14.6777 0.3834 13.9245 5.5959 16.4533 0.2947 0.0279 1.9813 13.3966 6.1110 21.1993 2.3433 19.3848 22.8214 28.9453 10.8902 87.2296 44.6164 2.5251 4.0259 37.8072 19.4380 9.6005 25.4250 15.5622 13.3432 15.7601 36.9661 24.3925 57.1038 27.0944 7.6193 119.9937 841.6770 40.1346 57.3439 44.0525 33.9060 282.4236 244.6571 48.6616 40.8021 11.2989 27.2761 36.5504 80.2920 22.4796 22.7577 15.1539 18.5701 18.8433 7.7346 6.0104 11.6523 10.8496 18.3883 27.1556 15.3998 9.3865 18.2857 3.7757 2.7430 91.9808 34.4413
temp: 298.150 k
press: 1.00000 atm
elementType: 16 8 8 8 8 7 7 6 6 6 6 6 6 6 6 6 6 6 6 6 6 6 6 6 6 6 6 1 1 1 1 1 1 1 1 1 1 1 1 1 1 1 1 1 1 1 1 1 1 1 1
symmnumber: 1
zpe: 1068193.6 jmol-1
zpe.correction: 0.406853 hartree
zpe.thermalcorrener: 0.433758 hartree
zpe.thermalcorrenthalpy: 0.434703 hartree
zpe.thermalcorrgfe: 0.345207 hartree
zpe.sumelectzpe: -1583.036036 hartree
zpe.sumelectthermal: -1583.009131 hartree
zpe.sumelectthermalent: -1583.008187 hartree
zpe.sumelectthermalfe: -1583.097683 hartree
dipole: -1.9417 2.7582 -0.8730
dipole: 3.4843
quadrupole: -132.8439 -165.7729 -168.2033
quadrupole: 13.6839 1.3487 -10.1286
quadrupole: 22.7628 -10.1662 -12.5966 13.6839 1.3487 -10.1286
hfenergy: -1583.4428896 hartree
pointgroup: C01 [X(C20H24N2O4S1)]
dipole: -1.3467691 0.0518768 0.2503095 debye
polarizability: 257.226905|-42.5543803|384.4005697|-26.424855|4.8179054|172.2167615 unknown
InChI: InChI=1S/C20H24N2O4S/c1-15-3-7-17(8-4-15)21-19(23)25-11-13-27-14-12-26-20(24)22-18-9-5-16(2)6-10-18/h3-10,21-22H,11-14H2,1-2H3
charge 0 multiplicity 1
51 atoms
S  -0.516574 4.129791 1.509363
O  1.20091 2.036587 -0.098551
O  -3.49263 3.530519 0.553499
O  3.472826 1.411739 -0.075101
O  -2.267359 2.680757 -1.2811
N  1.692239 -0.158183 0.063006
N  -3.212373 1.29321 0.389745
C  0.342752 4.292284 -0.176603
C  -1.953444 5.333242 1.282298
C  1.616961 3.45606 -0.185705
C  -2.999871 4.890504 0.247173
C  2.371144 -1.4050 0.162545
C  -2.837332 -0.011339 -0.032765
C  3.602328 -3.981217 0.367317
C  -2.155096 -2.69424 -0.770261
C  3.784533 -1.526513 0.095797
C  -2.011573 -0.251872 -1.164516
C  1.580421 -2.570564 0.335119
C  -3.307975 -1.111944 0.728991
C  4.374556 -2.802595 0.198337
C  -1.685923 -1.579133 -1.513703
C  2.193804 -3.836428 0.433785
C  -2.968013 -2.430279 0.36111
C  4.265935 -5.34345 0.478051
C  -1.803123 -4.113204 -1.181699
C  2.255164 1.100127 -0.037953
C  -2.906785 2.494938 -0.214817
H  -0.351576 3.940337 -0.957058
H  0.60135 5.354762 -0.332975
H  -2.403326 5.399008 2.287336
H  -1.559345 6.329387 1.008305
H  2.289665 3.693203 0.658643
H  2.174712 3.610315 -1.128811
H  -3.888835 5.542693 0.299133
H  -2.595191 4.898505 -0.780143
H  4.397787 -0.631709 -0.029541
H  -1.649634 0.591379 -1.756536
H  0.488666 -2.483714 0.39691
H  -3.942147 -0.938699 1.607743
H  5.467777 -2.882003 0.145596
H  -1.050731 -1.751101 -2.391723
H  1.565215 -4.724805 0.571531
H  -3.345529 -3.265865 0.962301
H  0.667613 -0.177968 0.064867
H  -3.732186 1.374485 1.266299
H  4.929058 -5.399043 1.362299
H  3.518722 -6.150795 0.56967
H  4.890399 -5.562301 -0.408685
H  -0.709833 -4.243605 -1.29039
H  -2.162065 -4.849973 -0.442242
H  -2.256771 -4.371593 -2.157389
