program: Gaussian 09
title: 000295395
version: EM64L-G09RevD.01
frameworkgroup: C1[X(C14H11ClN2O3)]
method: RPBEPBE
basis: SDD
operation: Freq
keyword: #p
keyword: freq=noraman
keyword: PBEPBE/SDD
title: #p freq=noraman PBEPBE/SDD
converged: YES YES NO NO
title: Mulliken charges:
elementType: Cl O O O N N C C C C C C C C C C C C C C H H H H H H H H H H H
charge: -0.054053 -0.247339 -0.197996 -0.202524 -0.484067 0.027789 0.354430 0.269305 0.266506 0.139650 -0.281432 -0.371492 -0.845323 -0.322612 -0.329955 -0.113082 -0.258801 0.388582 -0.357393 -0.368999 0.342153 0.333700 0.237135 0.228773 0.233345 0.253409 0.287383 0.230442 0.259414 0.292744 0.290308
chargesum: 0.00000
title: Mulliken charges with hydrogens summed into heavy atoms:
elementType: Cl O O O N N C C C C C C C C C C C C C C
charge: -0.054053 -0.247339 -0.197996 -0.202524 -0.141914 0.027789 0.354430 0.269305 0.266506 0.139650 0.052268 -0.134356 -0.129796 -0.035229 -0.099513 -0.113082 0.000612 0.388582 -0.064649 -0.078691
polarizability: 3.54318553e+02 1.05133534e+00 2.01132329e+02 -2.98262315e+00 -1.02510098e+01 8.19701304e+01
1716.lowfreq: -7.2177 -3.5150 0.0012 0.0015 0.0018 4.0444 19.2785 27.5112 48.8657
frequency: 19.2453 27.4874 48.8550 64.0171 83.1953 94.8287 110.4278 130.4694 179.0236 183.2827 217.2856 249.7950 262.3845 278.3572 304.7763 325.8717 359.8636 384.0878 408.0256 434.1929 450.2893 461.8199 496.6356 520.4548 572.9745 581.7395 622.6427 629.3508 640.1058 659.6133 683.6488 689.4501 722.0609 756.8927 764.1810 791.9103 809.3095 845.0114 862.3848 878.6295 893.4902 925.1832 943.1490 983.8040 984.8571 1002.7418 1009.2559 1041.9359 1072.0132 1086.8974 1093.6249 1113.0653 1135.9300 1182.0682 1187.8518 1217.4828 1237.1654 1266.8073 1273.9801 1297.9136 1365.2654 1372.0483 1395.1478 1400.8545 1409.7317 1410.6099 1450.7796 1476.3090 1480.2075 1482.7992 1511.0694 1580.4375 1589.5409 1605.6412 1609.4831 1613.0333 2953.7561 3022.7582 3090.4500 3129.3766 3138.1070 3166.3943 3179.4653 3183.8475 3188.6007 3199.2308 3541.5176
redmass: 6.8652 7.4982 7.9827 6.9409 6.8889 6.0384 4.6003 10.2606 5.2419 1.1280 5.1285 7.1754 4.8646 5.4997 8.6140 4.0634 10.3950 6.9842 2.8826 4.0394 3.0773 3.8081 7.7403 6.0650 3.4929 5.6700 6.3745 6.4608 1.4319 5.1821 6.7035 4.5623 3.4235 5.9451 4.8586 7.9732 1.2928 1.3814 6.0959 1.8521 3.7143 1.3573 1.3493 1.5295 1.3701 2.5288 1.5426 1.5206 2.8166 3.2380 2.7121 1.3270 1.5777 1.3782 2.0456 5.1076 3.0863 2.5291 1.4263 1.2936 6.7833 6.0787 1.3834 8.1486 3.6698 3.8158 1.9997 2.0187 1.2851 1.2221 2.0327 8.6674 5.2421 6.3698 4.6622 7.7914 1.0404 1.0979 1.0945 1.0905 1.0900 1.0900 1.0957 1.0944 1.0964 1.0932 1.0755
irintensity: 0.2059 0.1363 1.3125 0.7133 8.8310 0.9587 0.1004 1.8518 3.3465 0.4152 0.2566 0.6947 1.0290 0.6419 9.7864 2.6110 4.9161 2.2594 0.0837 4.4626 9.9479 12.2109 4.1300 1.9402 2.9837 16.4125 2.8286 13.7234 47.5242 1.9390 15.2779 50.1406 3.1628 25.8799 9.4552 25.6117 40.6521 12.0657 11.1189 49.2642 47.3448 29.9307 1.9414 21.2696 5.1073 11.1604 0.6266 6.3234 10.9426 36.6144 3.3111 23.5573 6.1466 35.4899 10.7281 445.7930 19.8392 31.2323 10.5836 1.7327 93.9215 37.2428 5.8049 13.2990 70.1064 50.0256 142.1214 11.7054 40.9904 45.8772 344.8794 106.2981 41.9583 25.1839 8.3971 61.6394 30.1877 20.8165 16.8082 12.3954 14.4521 0.9854 2.9279 1.6139 1.4194 16.7614 20.8125
temp: 298.150 k
press: 1.00000 atm
elementType: 17 8 8 8 7 7 6 6 6 6 6 6 6 6 6 6 6 6 6 6 1 1 1 1 1 1 1 1 1 1 1
symmnumber: 1
zpe: 586769.8 jmol-1
zpe.correction: 0.223489 hartree
zpe.thermalcorrener: 0.241205 hartree
zpe.thermalcorrenthalpy: 0.242149 hartree
zpe.thermalcorrgfe: 0.175304 hartree
zpe.sumelectzpe: -1333.857353 hartree
zpe.sumelectthermal: -1333.839636 hartree
zpe.sumelectthermalent: -1333.838692 hartree
zpe.sumelectthermalfe: -1333.905537 hartree
dipole: 2.6462 4.9167 0.5480
dipole: 5.6104
quadrupole: -164.8642 -115.7821 -124.2620
quadrupole: 15.3279 0.7688 -1.1781
quadrupole: -29.8947 19.1873 10.7074 15.3279 0.7688 -1.1781
hfenergy: -1334.0808414 hartree
pointgroup: C01 [X(C14H11Cl1N2O3)]
dipole: -1.1625475 -1.8639688 0.2151128 debye
polarizability: 353.7072592|-8.5718132|201.7504716|7.3287428|8.9635863|81.9632817 unknown
InChI: InChI=1S/C14H11ClN2O3/c1-9-2-5-11(15)8-13(9)16-14(18)10-3-6-12(7-4-10)17(19)20/h2-8,16H,1H3
charge 0 multiplicity 1
31 atoms
Cl -5.64325 2.341084 -0.335329
O  -0.608128 2.018064 -0.078907
O  6.245349 0.645518 0.455404
O  5.87861 -1.451753 -0.365035
N  -1.095213 -0.280256 0.063947
N  5.468434 -0.294885 0.035505
C  -2.518519 -0.289103 0.037735
C  -3.169748 -1.558796 0.165558
C  1.242255 0.457283 -0.015004
C  -0.228115 0.809269 -0.019818
C  -3.27305 0.904582 -0.113122
C  -4.581177 -1.588029 0.134341
C  -2.374979 -2.843889 0.327848
C  2.143049 1.463909 0.420905
C  1.754055 -0.791047 -0.461865
C  -4.673615 0.809634 -0.138869
C  -5.354369 -0.414592 -0.01796
C  4.005452 -0.030699 0.01422
C  3.5287 1.226823 0.445292
C  3.138991 -1.043375 -0.449321
H  -0.659375 -1.192478 0.209804
H  -2.761026 1.863642 -0.200096
H  -5.093771 -2.551599 0.230975
H  -1.71739 -3.044012 -0.542756
H  -1.742896 -2.836559 1.238935
H  -3.051942 -3.708552 0.418877
H  1.729546 2.42916 0.727993
H  1.087766 -1.561991 -0.866313
H  -6.446319 -0.455888 -0.040307
H  4.238798 1.985098 0.784664
H  3.557376 -1.991662 -0.796001
