program: Gaussian 09
title: 000295377
version: EM64L-G09RevD.01
frameworkgroup: C1[X(C11H15ClN2O)]
method: RPBEPBE
basis: SDD
operation: Freq
keyword: #p
keyword: freq=noraman
keyword: PBEPBE/SDD
title: #p freq=noraman PBEPBE/SDD
converged: YES YES NO NO
title: Mulliken charges:
elementType: Cl O N N C C C C C C C C C C C H H H H H H H H H H H H H H H
charge: -0.088379 -0.296245 -0.414287 -0.484163 -0.327420 -0.384966 -0.352666 -0.684608 0.290690 0.583928 -0.348459 -0.320326 -0.224490 -0.221200 -0.247493 0.216198 0.194511 0.208984 0.261445 0.193085 0.189249 0.290206 0.215100 0.216570 0.210574 0.292998 0.314723 0.252876 0.229977 0.233589
chargesum: 0.00000
title: Mulliken charges with hydrogens summed into heavy atoms:
elementType: Cl O N N C C C C C C C C C C C
charge: -0.088379 -0.296245 -0.124081 -0.191165 0.083289 0.085464 0.029667 -0.042365 0.290690 0.583928 -0.348459 -0.005603 0.028386 0.008777 -0.013904
polarizability: 2.11137671e+02 -6.84271218e+00 1.53296176e+02 1.97328785e+01 -9.02854970e+00 8.69587341e+01
1716.lowfreq: -5.7419 -0.0017 -0.0011 0.0007 0.5238 7.8141 15.8855 35.9278 50.7257
frequency: 14.4005 35.6760 50.6705 76.2885 87.6664 113.8545 127.7555 156.0167 198.1277 231.2542 242.0737 263.4347 268.4481 302.2017 357.4498 388.6568 404.1241 421.5613 437.7923 510.7245 538.5763 595.7149 633.5579 666.6671 700.3200 705.7635 716.0835 745.7860 756.8655 821.3394 829.8606 859.8617 869.6698 923.7159 944.2049 975.7366 993.3779 996.7361 1006.3121 1037.6857 1054.9612 1112.8309 1123.1452 1128.0208 1137.5683 1169.9274 1215.2341 1230.2654 1244.9938 1264.4284 1290.5128 1310.5942 1311.9922 1351.0296 1363.1687 1371.7886 1391.1944 1427.4442 1454.7660 1458.3223 1459.8570 1474.2290 1477.5812 1486.4194 1494.1799 1516.7228 1576.0778 1614.1698 1649.2863 2958.4267 2975.3090 2977.7835 2984.1975 3003.4812 3044.2782 3072.8767 3075.2831 3078.3813 3140.2073 3157.7531 3176.0755 3188.1185 3484.2869 3554.6206
redmass: 4.3808 4.4141 6.3126 2.9549 2.0348 4.2087 3.4516 4.7431 5.7240 1.1840 3.1358 3.7256 3.2617 3.3034 3.4442 1.9383 2.9679 6.1116 3.2358 2.6316 3.2305 5.7560 1.2244 6.6706 3.0425 9.6823 4.2814 1.2696 1.2355 3.7355 1.8582 2.1681 1.3397 1.6789 1.3529 1.7554 1.3050 4.0135 4.4703 2.0857 2.5453 2.5264 1.9224 2.0273 1.8754 1.0654 1.7883 1.3741 1.6066 1.3375 1.1085 1.4542 1.5971 1.4790 1.6997 2.8829 1.2110 2.6900 1.2679 1.2784 1.4648 1.0695 1.0435 1.0850 1.7131 2.5567 5.2293 7.0308 4.1323 1.0587 1.0391 1.0577 1.0674 1.0988 1.1013 1.1004 1.0996 1.0972 1.0865 1.0917 1.0977 1.0959 1.0759 1.0772
irintensity: 0.0494 0.4473 11.0223 2.2246 1.9244 3.2807 2.0007 0.2978 2.0065 0.2818 3.2310 1.3228 2.4164 5.4947 26.5094 29.6529 6.9068 4.8577 22.2853 4.6990 24.0945 1.8929 126.6411 21.5993 4.6963 9.8621 2.1595 11.7819 113.8194 1.1447 1.8668 5.9352 5.1401 5.0166 5.7465 8.1737 3.4084 27.9766 23.8620 11.9511 1.9040 3.5786 1.1508 2.8503 2.2017 0.6097 234.6057 54.8600 12.2073 97.2914 2.6099 90.3846 1.7593 6.2330 31.1734 98.5515 8.9205 62.8502 58.4998 18.8165 8.0958 16.9725 8.5390 21.4834 296.6180 606.6315 12.3204 102.1836 165.6283 29.4541 21.9728 61.3779 50.3953 7.1915 56.0686 76.7251 44.5599 10.6603 5.3840 12.6697 7.3005 16.1738 38.1664 20.2413
temp: 298.150 k
press: 1.00000 atm
elementType: 17 8 7 7 6 6 6 6 6 6 6 6 6 6 6 1 1 1 1 1 1 1 1 1 1 1 1 1 1 1
symmnumber: 1
zpe: 640228.2 jmol-1
zpe.correction: 0.243850 hartree
zpe.thermalcorrener: 0.259549 hartree
zpe.thermalcorrenthalpy: 0.260493 hartree
zpe.thermalcorrgfe: 0.198325 hartree
zpe.sumelectzpe: -1071.853515 hartree
zpe.sumelectthermal: -1071.837816 hartree
zpe.sumelectthermalent: -1071.836872 hartree
zpe.sumelectthermalfe: -1071.899040 hartree
dipole: -1.5686 2.0790 -0.3309
dipole: 2.6253
quadrupole: -80.4935 -100.6191 -99.2189
quadrupole: -5.3631 5.3245 -2.4604
quadrupole: 12.9503 -7.1753 -5.7750 -5.3631 5.3245 -2.4604
hfenergy: -1072.0973649 hartree
pointgroup: C01 [X(C11H15Cl1N2O1)]
dipole: -0.633946 0.8119399 -0.0754675 debye
polarizability: 212.2369166|-6.875946|153.7533153|16.5595307|-5.2420227|85.4023494 unknown
InChI: InChI=1S/C11H15ClN2O/c1-2-3-8-13-11(15)14-10-7-5-4-6-9(10)12/h4-7,13-14H,2-3,8H2,1H3
charge 0 multiplicity 1
30 atoms
Cl 2.150158 2.750977 -0.263166
O  -0.609526 -1.845134 -0.40075
N  -1.879439 0.067389 -0.844443
N  0.4035 0.296338 -0.394252
C  -4.106667 -0.518923 0.195824
C  -3.141067 -0.675473 -1.002385
C  -4.610008 0.926327 0.415874
C  -5.611907 1.034285 1.585906
C  -0.688613 -0.586554 -0.534236
C  1.738767 -0.032762 -0.080565
C  2.700031 1.011981 0.021878
C  2.200357 -1.361374 0.146103
C  4.048905 0.784611 0.33021
C  3.553962 -1.601273 0.457449
C  4.48534 -0.542097 0.552121
H  -3.603605 -0.885697 1.111799
H  -4.977811 -1.183394 0.022007
H  -3.638533 -0.3413 -1.93473
H  -2.860677 -1.735478 -1.125201
H  -5.087831 1.293451 -0.516369
H  -3.747239 1.594868 0.616152
H  -1.908973 1.085572 -0.908379
H  -5.148836 0.703759 2.534339
H  -5.963842 2.072868 1.724517
H  -6.498075 0.397129 1.406133
H  0.238275 1.297508 -0.536858
H  1.475742 -2.174232 0.069548
H  4.743098 1.627234 0.395594
H  3.881742 -2.632499 0.627237
H  5.535071 -0.735505 0.793643
