program: Gaussian 09
title: 000295386
version: EM64L-G09RevD.01
frameworkgroup: C1[X(C16H14ClNO4)]
method: RPBEPBE
basis: SDD
operation: Freq
keyword: #p
keyword: freq=noraman
keyword: PBEPBE/SDD
title: #p freq=noraman PBEPBE/SDD
converged: NO YES NO NO
title: Mulliken charges:
elementType: Cl O O O O N C C C C C C C C C C C C C C C C H H H H H H H H H H H H H H
charge: -0.054969 -0.338629 -0.288673 -0.260651 -0.252205 -0.457125 0.231969 0.382070 -0.326884 -0.329084 -0.401237 -0.299917 0.493626 0.186623 -0.433649 -0.325109 0.243785 -0.181375 -0.195076 -0.256603 -0.122014 -0.665180 0.274634 0.273522 0.257729 0.303829 0.338465 0.231991 0.302639 0.257836 0.257266 0.222044 0.234609 0.251429 0.226961 0.217353
chargesum: 0.00000
title: Mulliken charges with hydrogens summed into heavy atoms:
elementType: Cl O O O O N C C C C C C C C C C C C C C C C
charge: -0.054969 -0.338629 -0.288673 -0.260651 -0.252205 -0.118659 0.231969 0.382070 -0.052250 -0.055561 -0.143508 0.003911 0.493626 0.186623 -0.201657 -0.022470 0.243785 0.076461 0.062190 0.200050 -0.122014 0.030562
polarizability: 4.08462582e+02 -1.29669321e+00 1.92809012e+02 2.21030896e+00 6.29006754e+00 8.90839405e+01
1716.lowfreq: -7.3625 0.0024 0.0025 0.0026 1.1010 5.1091 16.0625 16.6000 36.4590
frequency: 15.2054 16.1473 36.4561 46.4005 49.6749 66.1660 68.0422 88.3054 111.8252 129.6135 159.5015 165.0300 177.7208 219.7292 266.6458 288.8571 300.3434 320.8999 332.7922 363.8674 364.7433 402.5036 411.7576 413.0830 441.5093 477.1924 503.0788 507.6248 595.0577 616.9606 626.1656 642.8490 673.8681 675.2874 691.4897 703.5566 709.3633 740.9963 752.7308 786.0587 815.7303 817.4384 840.9685 842.5915 848.7374 859.7252 871.9328 939.7302 954.8162 975.6840 987.4846 994.8476 998.0053 999.3434 1011.1008 1062.1394 1075.6409 1096.4274 1114.1232 1118.2001 1144.0902 1156.0988 1164.8755 1187.6755 1201.0780 1249.4592 1262.8919 1280.5577 1298.0974 1298.5759 1358.6898 1370.5545 1381.8503 1392.1506 1404.3559 1417.2938 1455.4181 1463.3332 1479.7933 1484.3524 1486.7600 1511.2756 1578.4680 1596.4344 1610.1686 1613.7991 1621.9753 1681.8630 2993.8212 3029.8244 3088.6681 3094.0988 3119.7634 3127.2930 3156.7559 3168.1992 3174.7658 3175.8820 3177.6368 3194.2439 3211.7428 3543.3082
redmass: 4.3783 7.3169 5.4250 5.4519 3.6339 6.6629 6.9966 5.4724 4.1390 6.9274 8.5427 8.0295 3.3748 1.4564 5.5483 7.9170 5.2047 3.8104 5.7354 7.1460 5.8088 5.3530 3.0067 2.9981 5.6710 5.0284 2.9668 2.9072 7.2316 7.2042 7.1842 1.5900 6.3134 4.7275 3.2291 3.4755 9.2504 3.4391 4.4521 4.0917 1.3779 1.5219 3.5915 1.4159 1.2900 5.8530 1.5713 1.3568 9.0606 1.3201 1.3424 4.1854 1.3416 3.2787 2.6295 4.1577 2.6699 2.1586 1.3581 1.3323 3.0696 1.7533 1.7558 1.1130 1.9050 3.8249 2.1475 1.1157 1.2971 1.3091 1.2969 5.4731 6.7996 1.2328 3.9936 3.8803 1.1058 1.0440 2.2154 1.2448 1.8086 2.3856 8.1495 5.6328 6.3220 6.9337 8.3653 9.4807 1.0363 1.0592 1.0973 1.1037 1.1057 1.0905 1.0885 1.0907 1.0925 1.0952 1.0957 1.0956 1.0949 1.0763
irintensity: 2.7670 0.2646 0.2547 0.5598 0.1901 4.9166 0.4197 0.1646 2.3326 1.1685 0.3965 2.7445 2.5221 2.3562 6.1820 1.1842 4.8221 8.1418 0.1787 21.1876 1.8314 18.4990 0.0046 0.0055 6.2464 4.4866 4.3801 40.4771 12.0639 6.0654 0.1767 24.0437 6.7713 10.4450 81.8657 1.6225 9.5677 9.3759 14.4393 1.8778 42.9713 1.1220 2.7400 59.6769 6.5633 4.7843 68.8583 1.5897 411.3514 2.3731 0.0272 22.3697 0.6049 9.9291 110.5110 454.2711 69.7496 28.8400 82.9175 31.2765 907.1400 24.6380 133.0974 6.6299 215.8703 471.3006 35.8881 3.2392 19.6811 0.2946 18.9899 132.3380 0.8123 25.0102 46.1450 48.2590 46.4590 15.0083 16.3230 199.1369 258.6651 536.9569 53.3628 53.5456 54.1448 31.3913 206.6038 243.7862 23.5592 38.1063 41.6979 0.8173 30.1763 12.7551 0.8462 1.8451 3.5428 2.3299 2.8768 5.0523 3.4666 35.7293
temp: 298.150 k
press: 1.00000 atm
elementType: 17 8 8 8 8 7 6 6 6 6 6 6 6 6 6 6 6 6 6 6 6 6 1 1 1 1 1 1 1 1 1 1 1 1 1 1
symmnumber: 1
zpe: 703354.6 jmol-1
zpe.correction: 0.267894 hartree
zpe.thermalcorrener: 0.288466 hartree
zpe.thermalcorrenthalpy: 0.289410 hartree
zpe.thermalcorrgfe: 0.214428 hartree
zpe.sumelectzpe: -1432.265978 hartree
zpe.sumelectthermal: -1432.245405 hartree
zpe.sumelectthermalent: -1432.244461 hartree
zpe.sumelectthermalfe: -1432.319443 hartree
dipole: -0.4094 1.1027 0.2408
dipole: 1.2006
quadrupole: -141.9181 -122.5396 -138.3536
quadrupole: 24.5948 0.3668 1.5144
quadrupole: -7.6477 11.7308 -4.0831 24.5948 0.3668 1.5144
hfenergy: -1432.5338715 hartree
pointgroup: C01 [X(C16H14Cl1N1O4)]
dipole: -0.1529174 0.349006 0.2791691 debye
polarizability: 408.3724411|-3.2466082|167.7442612|-3.8332765|44.9335108|114.2388326 unknown
InChI: InChI=1S/C16H14ClNO4/c1-2-21-15(19)11-3-9-14(10-4-11)22-16(20)18-13-7-5-12(17)6-8-13/h3-10,18H,2H2,1H3
charge 0 multiplicity 1
36 atoms
Cl 8.428293 -0.974639 -0.71351
O  0.449907 0.862844 0.33525
O  -5.637485 -0.868301 -0.840651
O  -6.014971 1.102395 0.355155
O  1.370965 -1.047344 -0.764896
N  2.674985 0.661694 0.226747
C  -3.731571 0.348987 -0.050801
C  -0.93403 0.597103 0.154327
C  -3.162115 1.456341 0.631594
C  -2.879431 -0.62784 -0.623797
C  -1.767776 1.582431 0.735184
C  -1.476987 -0.517512 -0.529493
C  4.007053 0.229601 -0.020165
C  -5.216018 0.264131 -0.135838
C  5.058804 1.059541 0.451237
C  4.314046 -0.974868 -0.706457
C  1.503036 0.029742 -0.142778
C  6.404763 0.69854 0.243095
C  5.662093 -1.336124 -0.914233
C  -7.114022 -1.057608 -0.972307
C  6.689257 -0.49966 -0.439892
C  -7.679696 -1.784582 0.250979
H  -3.830023 2.203994 1.070614
H  -3.322939 -1.478769 -1.147517
H  -1.309016 2.428094 1.255125
H  -0.823574 -1.270118 -0.970616
H  2.549889 1.541578 0.732363
H  4.831009 1.991644 0.982346
H  3.508562 -1.61518 -1.070812
H  7.213348 1.338749 0.606097
H  5.903905 -2.262985 -1.44196
H  -7.216488 -1.653947 -1.89323
H  -7.584481 -0.0673 -1.102439
H  -7.576698 -1.163847 1.156366
H  -7.162291 -2.74557 0.413945
H  -8.754797 -1.992714 0.095772
