program: Gaussian 09
title: 000295372
version: EM64L-G09RevD.01
frameworkgroup: C1[X(C14H13ClN2O2)]
method: RPBEPBE
basis: SDD
operation: Freq
keyword: #p
keyword: freq=noraman
keyword: PBEPBE/SDD
title: #p freq=noraman PBEPBE/SDD
converged: YES YES NO NO
title: Mulliken charges:
elementType: Cl O O N N C C C C C C C C C C C C C C H H H H H H H H H H H H H
charge: -0.073495 -0.332582 -0.286593 -0.495402 -0.506787 0.305677 0.175374 0.507587 -0.310129 0.266421 -0.322043 -0.234487 -0.251668 -0.444380 -0.347461 -0.039732 -0.191391 -0.264082 -0.526858 0.332331 0.307410 0.297015 0.239292 0.227467 0.226005 0.244704 0.312219 0.231230 0.256462 0.228726 0.228484 0.240685
chargesum: 0.00000
title: Mulliken charges with hydrogens summed into heavy atoms:
elementType: Cl O O N N C C C C C C C C C C C C C C
charge: -0.073495 -0.332582 -0.286593 -0.163071 -0.209772 0.305677 0.175374 0.507587 -0.002719 0.266421 -0.082751 -0.007020 -0.025663 -0.199676 -0.035242 -0.039732 0.039838 -0.007619 0.171037
polarizability: 3.23647012e+02 9.09662535e+00 2.02043710e+02 1.30109243e-01 -3.47735798e-01 7.46581552e+01
1716.lowfreq: -0.0004 0.0004 0.0017 4.2804 6.6671 13.2875 22.7669 36.2176 54.7038
frequency: 22.5870 35.9728 54.7034 74.2387 83.8289 99.5380 139.6376 169.7018 180.7081 186.0938 231.4844 240.3329 255.1726 265.4380 303.1829 321.1171 363.7807 410.7895 436.3907 446.8363 482.8004 499.0932 503.1931 558.5205 566.9136 577.5836 629.6945 672.1223 679.2934 688.4588 704.1894 733.9446 748.5724 753.1884 777.7171 786.9770 822.8641 854.6778 855.2944 891.1475 909.4326 936.2840 977.2024 984.2363 991.7425 995.8408 1008.9833 1041.9881 1072.8783 1095.9622 1110.1716 1118.2764 1151.6463 1174.1173 1177.2077 1188.7865 1196.6725 1250.5880 1261.3915 1303.2202 1312.9312 1365.9754 1395.1600 1413.9377 1429.8126 1450.9362 1466.6730 1470.5772 1475.0036 1486.9693 1510.6152 1524.3300 1584.7938 1606.3982 1612.8558 1616.2526 1650.5188 2969.0898 3059.8305 3126.7416 3137.3613 3137.8759 3145.6976 3154.7211 3170.9383 3179.0573 3196.6164 3202.1034 3486.0809 3528.8583
redmass: 5.7695 5.2022 6.4641 6.7712 4.2234 4.0142 6.2223 7.1534 4.1689 3.0484 2.9551 1.4911 4.9577 5.8391 3.2609 6.7181 6.4657 8.5399 2.8564 2.8311 6.3012 1.6062 6.2129 3.8686 5.7576 3.7147 6.6472 7.1526 1.7184 1.7381 4.6595 4.1711 5.9923 1.2560 6.6527 1.3065 6.2797 1.3789 1.6023 5.9721 1.3640 1.3446 5.8972 1.2938 1.3057 8.5430 7.1088 2.0540 1.9703 1.5509 2.0394 1.2563 1.4101 1.0799 1.1005 2.5254 2.3047 1.8252 1.6606 1.5980 1.9575 4.1810 5.7329 3.7341 1.5416 1.7687 1.0494 1.3641 2.7201 1.5259 2.2358 2.5413 5.1881 5.7689 6.8423 6.2471 3.8780 1.0322 1.1044 1.1004 1.0857 1.0925 1.0889 1.0914 1.0975 1.0957 1.0951 1.0951 1.0763 1.0761
irintensity: 0.3261 0.2820 0.2840 5.8406 1.4522 9.2020 5.7442 0.3449 3.2715 0.6085 2.6474 0.2882 1.7513 6.3395 0.4769 4.2131 5.0488 6.1184 6.1801 5.1228 5.3113 15.0730 23.3991 2.9845 4.1723 3.6450 0.2915 14.1964 8.5511 84.6482 53.9590 11.0369 17.3605 134.3797 2.0523 54.5717 18.4197 0.1494 52.7422 11.2241 4.5334 8.2179 17.2176 2.7892 5.5439 57.4335 44.0415 16.2863 22.2467 18.4877 52.0757 0.1771 12.8537 15.5851 12.4230 306.6324 76.7225 72.9347 71.8113 141.5726 6.0522 132.8449 121.6297 39.6530 115.7637 105.3321 14.1102 97.7459 281.8446 17.7624 810.7018 363.8843 169.8485 11.2412 192.9739 40.5431 88.4281 68.9311 42.1703 19.4785 0.7974 7.4679 10.0417 21.7616 20.5083 2.8164 7.7092 9.6573 65.8825 15.3017
temp: 298.150 k
press: 1.00000 atm
elementType: 17 8 8 7 7 6 6 6 6 6 6 6 6 6 6 6 6 6 6 1 1 1 1 1 1 1 1 1 1 1 1 1
symmnumber: 1
zpe: 639542.3 jmol-1
zpe.correction: 0.243589 hartree
zpe.thermalcorrener: 0.260885 hartree
zpe.thermalcorrenthalpy: 0.261829 hartree
zpe.thermalcorrgfe: 0.196649 hartree
zpe.sumelectzpe: -1259.960832 hartree
zpe.sumelectthermal: -1259.943536 hartree
zpe.sumelectthermalent: -1259.942592 hartree
zpe.sumelectthermalfe: -1260.007772 hartree
dipole: -3.8752 3.7760 0.0276
dipole: 5.4107
quadrupole: -108.9660 -104.4372 -124.5714
quadrupole: -18.3302 -0.0316 -0.0539
quadrupole: 3.6922 8.2210 -11.9132 -18.3302 -0.0316 -0.0539
hfenergy: -1260.2044206 hartree
pointgroup: C01 [X(C14H13Cl1N2O2)]
dipole: -1.556174 -1.4425044 -0.170329 debye
polarizability: 322.9961228|-12.2713658|201.8003976|5.8953929|9.4848147|75.5523567 unknown
InChI: InChI=1S/C14H13ClN2O2/c1-19-13-8-3-2-7-12(13)17-14(18)16-11-6-4-5-10(15)9-11/h2-9,16-17H,1H3
charge 0 multiplicity 1
32 atoms
Cl 6.226419 -1.909293 -0.056796
O  -2.874862 -2.078698 -0.339973
O  0.167669 1.777306 0.065409
N  -1.036514 -0.240055 -0.125429
N  1.287991 -0.300075 -0.060603
C  -2.369465 0.240513 -0.127905
C  -3.383311 -0.761693 -0.244738
C  2.644555 0.110897 0.000287
C  -2.753668 1.597784 -0.027098
C  0.136709 0.515718 -0.032279
C  -4.747162 -0.417277 -0.25995
C  -4.12584 1.940689 -0.042737
C  -5.118819 0.945925 -0.157828
C  3.627983 -0.917607 -0.047168
C  3.053245 1.469248 0.101935
C  4.985722 -0.56814 0.007061
C  4.429583 1.772695 0.153568
C  5.421969 0.765769 0.107556
C  -3.838095 -3.172399 -0.471727
H  -0.984891 -1.260682 -0.208083
H  -1.976334 2.35849 0.060413
H  1.147201 -1.309778 -0.135257
H  -5.518451 -1.187966 -0.349454
H  -4.412301 2.994566 0.036121
H  -6.179227 1.218589 -0.169138
H  3.336475 -1.971026 -0.125728
H  2.296397 2.253523 0.138183
H  4.739581 2.820317 0.231945
H  6.48681 1.00848 0.148345
H  -4.440428 -3.061289 -1.393413
H  -4.506954 -3.219982 0.408568
H  -3.234284 -4.089952 -0.530388
