program: Gaussian 09
title: 000295366
version: EM64L-G09RevD.01
frameworkgroup: C1[X(C13H11ClN2O)]
method: RPBEPBE
basis: SDD
operation: Freq
keyword: #p
keyword: freq=noraman
keyword: PBEPBE/SDD
title: #p freq=noraman PBEPBE/SDD
converged: YES YES NO NO
title: Mulliken charges:
elementType: Cl O N N C C C C C C C C C C C C C H H H H H H H H H H H
charge: -0.069965 -0.281878 -0.510964 -0.503659 0.505310 0.476739 -0.441529 -0.344896 0.279606 -0.447078 -0.332216 -0.041482 -0.191061 -0.197039 -0.213943 -0.261606 -0.257053 0.293488 0.289533 0.244326 0.312116 0.213695 0.306026 0.232474 0.226619 0.226911 0.257623 0.229903
chargesum: 0.00000
title: Mulliken charges with hydrogens summed into heavy atoms:
elementType: Cl O N N C C C C C C C C C C C C C
charge: -0.069965 -0.281878 -0.217476 -0.214125 0.505310 0.476739 -0.197203 -0.032781 0.279606 -0.233382 -0.026190 -0.041482 0.041413 0.029579 0.012968 -0.003983 -0.027150
polarizability: 3.09757990e+02 -7.42821162e-01 1.70287554e+02 1.27782402e-02 1.97190053e-02 6.34066998e+01
1716.lowfreq: -6.7223 -6.4607 -1.3802 -0.0022 -0.0017 -0.0011 15.9487 31.7611 63.7446
frequency: 15.6376 31.6991 63.7380 70.1264 77.8254 155.4725 181.3627 216.0200 224.9303 230.2777 267.2161 346.7232 369.6031 406.9104 411.5488 431.4913 445.7497 513.8801 519.1296 567.9331 613.0831 618.2951 632.6089 674.0429 683.2265 695.4915 697.8603 765.8779 771.3586 787.8835 813.5945 838.5318 855.1099 889.0578 909.9011 914.1126 970.8645 977.4774 983.3773 990.8426 998.9534 1005.4250 1030.4169 1072.6578 1090.6629 1097.6469 1172.6094 1175.6517 1179.4198 1189.3774 1244.1523 1268.7784 1308.2962 1319.8276 1367.0399 1384.2229 1411.2823 1429.7320 1473.2148 1486.6996 1510.8907 1516.8505 1585.7770 1602.3768 1613.7044 1616.4263 1653.4721 3103.8715 3132.9897 3139.9999 3144.8116 3146.7262 3166.4911 3180.9436 3199.2930 3204.2722 3518.6977 3531.1051
redmass: 4.5712 5.4940 6.7979 7.5385 4.6257 8.3487 5.4561 6.5514 2.6805 4.0005 7.2881 8.6279 6.0023 2.9290 8.2852 2.0970 1.9869 7.4717 2.6474 3.8479 6.4325 1.2548 6.8210 7.4581 2.3156 1.9956 10.6935 1.6895 7.1834 1.3060 6.2412 1.2731 1.6127 5.9253 1.3666 1.4231 1.3512 5.8784 6.1508 1.3095 1.3043 6.1474 2.1704 1.9705 1.5658 1.5698 1.0542 1.6091 1.4844 1.1119 1.9382 1.7626 1.6956 1.4887 3.9991 6.4707 3.5913 2.3898 2.6845 2.3985 2.1071 2.1483 5.0420 5.4245 6.4717 5.9021 3.9067 1.0890 1.0866 1.0922 1.0932 1.0890 1.0999 1.0956 1.0947 1.0950 1.0765 1.0756
irintensity: 0.8480 0.0544 0.3435 9.8326 1.5745 4.5949 0.9558 4.3581 0.0543 3.9093 4.8217 1.8446 6.5346 0.0083 5.8546 1.9223 7.5433 17.4121 28.4595 3.3841 1.1090 113.0763 0.5205 15.2840 23.3079 59.4071 14.0402 94.7611 0.7150 57.6151 28.9945 0.0011 49.8326 11.9269 2.1475 16.8279 0.1800 15.0270 2.5099 4.1409 3.5656 22.4129 0.8391 21.9893 16.0207 20.0713 1.3945 216.7471 135.8113 3.1482 154.6023 43.1782 49.0751 66.0355 117.4346 155.8247 23.7050 144.9544 406.6545 56.5409 759.9126 80.4149 183.1966 43.6804 176.6780 4.4907 106.1213 19.0019 0.2107 7.5724 29.3974 9.5349 27.1699 2.4859 8.8624 9.3921 7.2325 15.6041
temp: 298.150 k
press: 1.00000 atm
elementType: 17 8 7 7 6 6 6 6 6 6 6 6 6 6 6 6 6 1 1 1 1 1 1 1 1 1 1 1
symmnumber: 1
zpe: 555693.1 jmol-1
zpe.correction: 0.211652 hartree
zpe.thermalcorrener: 0.226433 hartree
zpe.thermalcorrenthalpy: 0.227377 hartree
zpe.thermalcorrgfe: 0.167121 hartree
zpe.sumelectzpe: -1145.605077 hartree
zpe.sumelectthermal: -1145.590296 hartree
zpe.sumelectthermalent: -1145.589352 hartree
zpe.sumelectthermalfe: -1145.649609 hartree
dipole: 1.7384 -2.7517 -0.0022
dipole: 3.2548
quadrupole: -107.4528 -93.5181 -113.2176
quadrupole: -10.4894 0.0054 0.0120
quadrupole: -2.7233 11.2114 -8.4881 -10.4894 0.0054 0.0120
hfenergy: -1145.8167293 hartree
pointgroup: C01 [X(C13H11Cl1N2O1)]
dipole: -0.7403715 -1.0448276 0.0000814 debye
polarizability: 309.4446471|-6.6449432|170.6008534|-0.0286115|0.0704066|63.4067441 unknown
InChI: InChI=1S/C13H11ClN2O/c14-10-5-4-8-12(9-10)16-13(17)15-11-6-2-1-3-7-11/h1-9,15-16H
charge 0 multiplicity 1
28 atoms
Cl 5.900885 -1.782717 -0.003292
O  -0.440321 1.384724 0.002242
N  0.843042 -0.596811 0.001402
N  -1.485686 -0.730417 0.001473
C  2.162556 -0.069763 0.000674
C  -2.863667 -0.365903 0.000755
C  3.227496 -1.014354 -0.000739
C  2.456082 1.321368 0.001304
C  -0.370449 0.122341 0.002612
C  -3.809845 -1.427611 -0.000549
C  -3.319046 0.979595 0.001295
C  4.551776 -0.550237 -0.001471
C  3.802491 1.741195 0.000523
C  -5.191596 -1.151449 -0.001292
C  -4.707006 1.237492 0.00053
C  4.874865 0.819121 -0.000873
C  -5.651443 0.185997 -0.00076
H  0.792032 -1.617714 0.000776
H  -1.317347 -1.738849 0.000877
H  3.025734 -2.091484 -0.001263
H  1.636635 2.040591 0.002388
H  -3.463829 -2.470227 -0.000981
H  -2.592004 1.792856 0.0023
H  4.02402 2.813817 0.001022
H  -5.906951 -1.981221 -0.002294
H  -5.050065 2.278231 0.000958
H  5.915841 1.151688 -0.00147
H  -6.724799 0.402244 -0.001341
