program: Gaussian 09
title: 000295496
version: EM64L-G09RevD.01
frameworkgroup: C1[X(C20H25N3O4S)]
method: RPBEPBE
basis: SDD
operation: Freq
keyword: #p
keyword: freq=noraman
keyword: PBEPBE/SDD
title: #p freq=noraman PBEPBE/SDD
converged: YES YES NO NO
title: Mulliken charges:
elementType: S O O O O N N N C C C C C C C C C C C C C C C C C C C C H H H H H H H H H H H H H H H H H H H H H H H H H
charge: 0.762729 -0.649844 -0.610435 -0.265988 -0.250372 0.058609 -0.237021 -0.018157 -0.465152 -0.054120 -0.381523 0.139842 0.158790 0.177368 -0.164516 -0.519454 -0.773036 -0.757861 -0.228030 -0.199335 0.263767 -0.389276 -0.360243 0.451879 -0.232683 -0.804841 -0.264700 -0.664508 0.271963 0.257033 0.227652 0.236038 0.424171 0.253300 0.245699 0.262798 0.243145 0.244269 0.236178 0.244758 0.268760 0.292505 0.256287 0.234943 0.232654 0.235974 0.226433 0.227694 0.223918 0.239398 0.218063 0.226213 0.248260
chargesum: 0.00000
title: Mulliken charges with hydrogens summed into heavy atoms:
elementType: S O O O O N N N C C C C C C C C C C C C C C C C C C C C
charge: 0.762729 -0.225673 -0.610435 -0.265988 -0.250372 0.058609 -0.237021 -0.018157 0.063845 -0.054120 0.082168 0.139842 0.158790 0.177368 -0.164516 -0.020454 -0.022824 -0.008166 0.064475 0.056952 0.263767 -0.154332 -0.127588 0.451879 -0.232683 -0.114739 0.198617 0.028028
polarizability: 3.94379836e+02 2.99231527e+01 3.24822847e+02 2.99213101e+01 -2.44853249e+01 1.97297418e+02
1716.lowfreq: -27.7685 -10.3502 -3.9762 -1.4575 0.0013 0.0014 0.0017 3.8177 10.8961
frequency: -27.6944 -9.0869 10.7302 14.2984 20.4497 21.1550 28.0906 37.1359 41.7770 49.9692 61.8157 66.3605 80.6351 81.8855 88.6668 97.2326 108.6996 118.4395 119.9481 132.9827 144.5305 180.8429 188.2775 207.1368 227.9747 232.0083 245.8397 253.9039 258.3824 259.5819 304.1367 320.8559 324.4668 332.3848 344.6131 364.9438 387.5023 401.7448 405.1264 424.2060 448.8286 488.6952 500.2234 506.9841 524.7055 551.3743 563.1430 586.3212 608.7113 619.7462 627.1961 629.7674 648.1417 691.5449 712.4618 731.7378 752.2989 779.6002 797.2935 814.4716 819.0823 820.7478 825.4152 853.3395 858.1251 872.7088 895.4640 954.3313 974.2840 983.7997 987.7931 997.4768 1001.1953 1009.2985 1019.7274 1031.8292 1045.1592 1047.6437 1050.4599 1055.0699 1064.7067 1075.7128 1094.5515 1102.0240 1112.7111 1115.9751 1131.4849 1156.6296 1180.4494 1182.3109 1217.8050 1218.6309 1271.9847 1277.6978 1279.2101 1291.4802 1323.8770 1332.9985 1341.0701 1353.8043 1361.7764 1370.4168 1377.6932 1389.8170 1391.8225 1396.6184 1397.0385 1405.4123 1426.4975 1439.2866 1440.5948 1454.1736 1456.5013 1459.6982 1462.4335 1462.5824 1464.2867 1470.7075 1473.3796 1475.3025 1484.3220 1502.6409 1590.9725 1599.8894 1601.3882 1632.7434 1638.0013 2160.5823 2690.8148 2961.1094 2975.8422 2976.5782 2983.0328 2992.2622 2997.5525 3020.9477 3027.2643 3030.9673 3047.6035 3055.6314 3056.2691 3057.2931 3087.0491 3087.0734 3087.6533 3093.1905 3100.8441 3119.5776 3121.3615 3123.6690 3125.1600 3143.3092 3158.3948
redmass: 1.0307 3.7127 5.2472 5.5173 4.5988 4.0821 5.3884 5.1174 6.1017 5.9377 6.3965 4.7535 1.2638 3.1052 4.5003 2.9614 4.2787 2.5876 1.5016 2.7413 4.4864 2.1642 5.7857 2.4131 2.6411 2.7204 4.4868 1.8527 5.5686 4.4471 4.7107 3.4191 7.2983 4.2250 3.3159 3.5068 4.1175 4.1397 2.9310 6.1270 6.4599 3.4890 5.7421 3.0606 8.2754 3.2714 13.8050 5.7866 4.1892 4.4201 6.9851 3.5280 3.9155 6.2261 3.3057 7.4595 1.7678 4.7859 1.4190 2.3045 1.9444 2.3173 3.7408 1.2477 2.5218 2.4675 1.1183 1.3367 2.4079 1.4192 1.3895 2.2369 4.1771 2.7049 1.4441 2.4477 1.7140 1.5789 2.6812 2.5376 3.2384 3.7931 2.2826 3.6257 1.2841 3.0606 2.5147 1.6831 1.1540 1.3705 2.9014 1.2856 4.6852 1.2332 1.1283 1.2766 1.2814 2.2215 1.3715 1.4442 1.4286 1.3682 4.6634 1.2356 3.4435 1.2388 1.2693 1.2798 1.1112 1.0947 1.1538 1.0483 1.0958 1.0906 1.1853 1.0453 1.0427 1.0767 1.0749 2.4297 1.0514 3.7929 6.8084 7.1956 6.1643 10.8393 8.5709 12.5957 1.0786 1.0567 1.0387 1.0384 1.0390 1.0359 1.0622 1.0616 1.0997 1.0596 1.0960 1.0971 1.0959 1.0955 1.1040 1.0995 1.0975 1.1030 1.0985 1.1065 1.0984 1.0878 1.0888 1.0959 1.0957
irintensity: 0.5252 0.0687 0.7443 0.2895 4.2670 0.2611 0.5945 2.2232 2.4613 0.7992 1.9530 0.1216 0.4431 0.5429 0.9495 3.0112 4.1706 3.7607 1.4879 1.8497 1.4263 1.7037 36.8428 1.5555 0.4864 4.4210 8.2234 1.7455 3.3342 5.8737 3.3606 28.1599 13.0601 10.8535 2.6310 7.2586 5.2916 8.1911 2.0443 39.2763 4.3315 3.9551 2.1024 30.2337 0.9023 1.7629 62.5295 16.5118 6.7970 7.6501 0.7490 5.7723 3.7790 2.4572 1.5742 9.0762 15.3823 0.6861 5.5838 40.3185 4.6206 30.8902 29.0384 7.2094 32.5483 5.8331 194.3431 1.7641 42.5752 4.2027 2.1857 20.7291 8.8255 21.6373 9.3115 27.3574 1.6684 19.1153 16.5078 30.1482 14.9896 29.4832 57.0939 23.2132 11.3670 12.0603 275.7917 24.8529 19.1025 59.3855 4.9161 2.7746 28.7248 2.8514 2.5198 2.1047 4.2051 13.1211 51.1174 64.2591 14.4268 0.6159 0.8011 23.7056 6.6261 13.3905 21.0189 57.5948 14.2904 44.6682 24.0199 3.6753 7.3599 12.7322 47.4197 35.8201 14.5773 14.0959 13.9157 28.7256 11.6159 8.5640 1.5681 1.7342 6.8345 40.5304 128.2248 37.8341 1922.3240 3.2611 6.4923 38.1415 6.5326 22.1655 15.1991 15.1643 22.5202 25.2732 7.5777 10.6564 10.5495 21.6884 25.9212 17.2598 29.4872 1.2482 7.2823 34.4608 4.5922 14.6230 12.6714 22.0771 8.5286
temp: 298.150 k
press: 1.00000 atm
elementType: 16 8 8 8 8 7 7 7 6 6 6 6 6 6 6 6 6 6 6 6 6 6 6 6 6 6 6 6 1 1 1 1 1 1 1 1 1 1 1 1 1 1 1 1 1 1 1 1 1 1 1 1 1
symmnumber: 1
zpe: 1080868.3 jmol-1
zpe.correction: 0.411681 hartree
zpe.thermalcorrener: 0.442348 hartree
zpe.thermalcorrenthalpy: 0.443292 hartree
zpe.thermalcorrgfe: 0.343320 hartree
zpe.sumelectzpe: -1638.133420 hartree
zpe.sumelectthermal: -1638.102752 hartree
zpe.sumelectthermalent: -1638.101808 hartree
zpe.sumelectthermalfe: -1638.201781 hartree
dipole: -0.8309 2.3433 -1.4131
dipole: 2.8597
quadrupole: -154.2136 -130.9090 -174.7019
quadrupole: -2.6999 1.1816 -2.1778
quadrupole: -0.9388 22.3658 -21.4270 -2.6999 1.1816 -2.1778
hfenergy: -1638.5451006 hartree
pointgroup: C01 [X(C20H25N3O4S1)]
dipole: -0.8936675 0.6795333 0.0739071 debye
polarizability: 356.6296411|39.8180736|332.6770792|14.1127156|76.5087|227.1933808 unknown
InChI: InChI=1S/C13H17N3O2.C7H8O2S/c1-4-18-12(17)6-5-7-15-13-11(8-14)9(2)10(3)16-13;1-6-2-4-7(5-3-6)10(8)9/h4-7H2,1-3H3;2-5,8H,1H3
charge 0 multiplicity 1
53 atoms
S  -1.758182 -1.471215 -0.64711
O  -3.050138 -0.470624 0.206967
O  -0.620765 -2.041514 0.414022
O  5.670222 0.71046 -0.744743
O  4.076781 2.413516 -0.83284
N  0.074955 0.904953 0.273231
N  -1.930127 1.775531 1.147272
N  2.466844 2.813864 3.187538
C  1.505752 0.593036 0.22116
C  -0.483173 1.652711 1.176781
C  1.954926 0.466951 -1.251543
C  0.01086 2.471362 2.343214
C  -1.106919 3.044282 2.936465
C  -2.288996 2.562194 2.15809
C  -2.917432 -2.951592 -0.821875
C  3.441197 0.079168 -1.370932
C  -1.171293 3.958099 4.121964
C  -3.715703 2.885822 2.474665
C  -2.492471 -4.17457 -0.279677
C  -4.143955 -2.819348 -1.499893
C  4.382354 1.204202 -0.958391
C  -3.324526 -5.306467 -0.428976
C  -4.962865 -3.96118 -1.639618
C  -4.563958 -5.220169 -1.114669
C  1.352315 2.64729 2.778652
C  -5.441198 -6.446339 -1.297975
C  6.719879 1.714222 -0.377084
C  7.329329 2.344608 -1.632279
H  1.595519 -0.404771 0.700657
H  2.146527 1.310634 0.769053
H  1.781518 1.427538 -1.768608
H  1.328666 -0.299825 -1.740949
H  -2.642254 0.461748 0.435699
H  3.679611 -0.177141 -2.421965
H  3.681212 -0.822456 -0.777803
H  -0.171049 4.152403 4.541381
H  -1.804365 3.526213 4.920643
H  -1.62618 4.929758 3.848863
H  -3.886552 3.979046 2.468583
H  -3.985187 2.526201 3.485997
H  -4.388489 2.413413 1.743297
H  -1.540874 -4.21158 0.263908
H  -4.468911 -1.845944 -1.880855
H  -3.008787 -6.267315 -0.005205
H  -5.926274 -3.872412 -2.156327
H  -5.322479 -6.871034 -2.313772
H  -5.1836 -7.240282 -0.575947
H  -6.510994 -6.201495 -1.170742
H  7.455532 1.121202 0.189121
H  6.259926 2.477265 0.274999
H  8.157206 3.019511 -1.345637
H  7.733444 1.569635 -2.306338
H  6.575924 2.937835 -2.177167
