program: Gaussian 09
title: 000295373
version: EM64L-G09RevD.01
frameworkgroup: C1[X(C19H22N2O4)]
method: RPBEPBE
basis: SDD
operation: Freq
keyword: #p
keyword: freq=noraman
keyword: PBEPBE/SDD
title: #p freq=noraman PBEPBE/SDD
converged: YES YES NO NO
title: Mulliken charges:
elementType: O O O O N N C C C C C C C C C C C C C C C C C C C H H H H H H H H H H H H H H H H H H H H H H
charge: -0.300835 -0.262400 -0.332948 -0.281801 -0.499510 -0.495303 -0.044185 -0.285076 -0.698185 -0.691158 0.242198 0.173775 0.490412 -0.356389 -0.326206 -0.332652 -0.448879 0.306512 0.175103 0.263289 -0.309713 -0.321819 -0.234385 -0.251161 -0.526847 0.207612 0.213886 0.233307 0.219619 0.211983 0.213010 0.209732 0.214025 0.231698 0.268958 0.270266 0.310357 0.217012 0.294843 0.332408 0.307800 0.239328 0.228132 0.226272 0.228867 0.228745 0.240303
chargesum: 0.00000
title: Mulliken charges with hydrogens summed into heavy atoms:
elementType: O O O O N N C C C C C C C C C C C C C C C C C C C
charge: -0.300835 -0.262400 -0.332948 -0.281801 -0.204666 -0.162895 0.163428 0.162117 -0.053573 -0.035704 0.242198 0.173775 0.490412 -0.087432 -0.055940 -0.022295 -0.231867 0.306512 0.175103 0.263289 -0.001913 -0.082491 -0.006252 -0.024889 0.171068
polarizability: 4.62315578e+02 4.93627397e+00 2.36962449e+02 -1.41835279e+01 -7.46432492e+00 1.22220586e+02
1716.lowfreq: -7.1737 -4.5043 -0.0014 0.0007 0.0017 1.2640 10.5084 16.6973 26.3689
frequency: 9.4995 16.6508 26.3609 35.4750 38.1261 54.7709 65.6181 75.4227 83.9041 97.1879 115.3751 128.1638 143.6594 183.3962 198.0002 206.9381 230.8345 234.1724 239.0769 242.9987 287.9971 302.1007 305.7137 312.6464 330.4436 350.9225 374.0615 409.8029 414.3566 432.5779 445.1032 482.1014 491.1731 530.4913 536.5012 540.4980 565.1643 575.6871 627.9171 651.1685 674.0568 685.6096 704.8690 733.1910 734.5474 751.4248 756.0528 761.0564 779.2039 808.4010 813.7984 834.8600 852.2441 883.4071 884.9920 894.2121 919.1640 929.6683 934.8267 959.2252 965.5924 972.7516 983.0990 995.9972 999.1547 1004.8426 1011.0864 1040.2883 1049.4422 1108.5699 1116.2909 1125.9202 1134.2742 1150.7336 1167.9927 1173.2418 1181.9460 1185.9834 1187.7776 1196.1438 1247.0549 1251.1516 1255.6520 1272.8261 1294.2029 1306.3430 1311.8061 1344.7322 1358.7497 1369.2244 1379.6917 1395.3351 1397.5840 1424.8977 1427.9525 1450.6512 1458.6753 1465.2324 1469.0988 1469.7082 1472.5655 1483.5393 1485.6637 1490.3356 1494.1151 1508.3067 1526.5100 1582.8871 1605.6147 1613.0242 1620.3684 1623.5294 1652.8571 2967.6784 2972.0729 2978.9141 2983.0853 3007.5408 3058.3694 3063.8855 3072.0749 3077.5402 3082.3075 3083.7906 3112.0219 3125.5017 3136.9705 3152.8989 3156.7005 3168.9607 3178.2836 3197.5882 3200.3613 3485.7228 3523.3777
redmass: 3.8601 4.8293 4.4647 3.0266 4.9758 4.4476 5.4336 4.8552 5.3452 4.1992 4.5601 5.4499 4.7182 2.3168 1.4268 2.2351 2.7634 1.5575 1.9255 1.8134 3.6909 3.3061 4.6460 4.1719 5.8828 6.1776 2.8954 1.8984 2.9618 4.9832 2.8156 6.1099 2.0510 4.7963 4.7172 2.3588 2.8151 6.3744 7.0922 6.3800 3.5389 1.5153 4.3413 3.9617 5.7301 1.2704 4.4880 6.0076 6.5310 5.9618 2.6317 1.4317 1.3805 5.8329 1.4686 2.4841 1.2129 1.6570 1.3486 2.1432 1.5554 1.3643 1.2977 7.9716 6.6809 3.5940 1.3265 2.0521 4.0469 2.0473 1.2569 1.3531 2.2759 1.4117 1.9003 1.0788 1.3811 1.8316 1.9353 2.2827 2.7835 1.1988 2.0445 1.9034 1.3731 1.4153 1.9864 1.4276 1.3939 4.6457 1.2141 5.7686 1.2155 4.2399 1.5890 1.7750 1.0821 1.0540 1.0618 1.3023 1.0688 1.0541 1.5898 1.0525 2.1035 2.6712 2.6518 5.4675 5.7680 6.5791 7.0354 7.4399 3.9875 1.0323 1.0355 1.0362 1.0836 1.0566 1.1045 1.1000 1.1010 1.1005 1.1017 1.1029 1.0901 1.1002 1.0857 1.0914 1.0910 1.0983 1.0942 1.0950 1.0948 1.0762 1.0758
irintensity: 0.1070 0.0554 1.4362 0.1422 0.1799 0.1758 0.8902 1.3620 1.7857 12.0317 0.8883 1.6846 0.5480 1.6801 0.9218 2.5723 1.3800 0.6536 4.4998 1.1257 0.2029 0.1375 3.9356 9.5409 21.8217 14.9900 2.0428 2.3915 0.0738 3.7264 2.8327 2.6583 27.3263 2.1213 10.8355 1.1856 4.1407 2.4889 6.2724 1.6610 6.4431 87.9056 49.4731 13.0935 9.3105 132.5588 15.7814 11.8945 2.8518 2.8414 4.0632 35.5163 1.2735 0.7840 50.1510 3.4899 5.8542 18.5971 8.2110 52.9328 0.5462 0.0944 3.2147 46.1069 21.5028 118.8548 1.1945 15.5154 505.9291 47.3132 0.1432 20.2903 0.7712 22.4507 24.9166 25.7544 514.4183 3.3729 57.8372 72.8964 359.2096 2.5773 188.1505 159.3193 5.7003 104.1844 6.8567 3.7533 39.6402 360.4480 23.0313 146.3273 9.0128 24.9492 114.9577 96.2113 10.9587 15.9077 27.9238 89.8145 23.3336 13.0635 18.9166 29.0022 126.8554 1271.9654 131.1636 96.6111 17.9049 137.7438 246.5458 109.5290 105.1188 72.7209 41.2125 21.1852 15.6541 59.0878 41.7655 26.5452 11.3521 56.4129 40.5774 48.2821 22.3166 19.8110 0.3544 20.1346 1.7039 23.8396 2.4396 7.9320 4.9362 75.0735 16.7032
temp: 298.150 k
press: 1.00000 atm
elementType: 8 8 8 8 7 7 6 6 6 6 6 6 6 6 6 6 6 6 6 6 6 6 6 6 6 1 1 1 1 1 1 1 1 1 1 1 1 1 1 1 1 1 1 1 1 1 1
symmnumber: 1
zpe: 991306.7 jmol-1
zpe.correction: 0.377569 hartree
zpe.thermalcorrener: 0.402451 hartree
zpe.thermalcorrenthalpy: 0.403395 hartree
zpe.thermalcorrgfe: 0.318715 hartree
zpe.sumelectzpe: -1145.816996 hartree
zpe.sumelectthermal: -1145.792114 hartree
zpe.sumelectthermalent: -1145.791169 hartree
zpe.sumelectthermalfe: -1145.875850 hartree
dipole: -3.7960 7.1209 0.0683
dipole: 8.0698
quadrupole: -107.7653 -138.0521 -153.2183
quadrupole: -7.5430 0.7086 -2.0579
quadrupole: 25.2466 -5.0402 -20.2064 -7.5430 0.7086 -2.0579
hfenergy: -1146.1945647 hartree
pointgroup: C01 [X(C19H22N2O4)]
dipole: 1.4852316 -2.6769525 -0.8413901 debye
polarizability: 462.0917304|-1.2756664|221.287318|17.4091169|40.0250572|138.1195643 unknown
InChI: InChI=1S/C19H22N2O4/c1-13(2)12-25-18(22)14-8-10-15(11-9-14)20-19(23)21-16-6-4-5-7-17(16)24-3/h4-11,13,20-21H,12H2,1-3H3
charge 0 multiplicity 1
47 atoms
O  -5.441307 -0.310976 -0.899449
O  -5.148992 1.833197 -0.001819
O  5.192307 -2.042745 -0.747931
O  1.959123 1.483473 0.432794
N  0.952469 -0.471496 -0.435948
N  3.265544 -0.37014 -0.210229
C  -7.596199 -1.106915 0.048726
C  -6.918273 -0.122035 -0.922558
C  -9.130783 -1.010971 -0.132533
C  -7.179719 -0.838405 1.511566
C  -3.211521 0.414127 -0.418659
C  -4.65959 0.746289 -0.402327
C  -0.41881 -0.123013 -0.406869
C  -2.285794 1.383429 0.048088
C  -2.722734 -0.835799 -0.882238
C  -0.903288 1.131936 0.059774
C  -1.344969 -1.100006 -0.876301
C  4.569209 0.101709 0.083043
C  5.631504 -0.810306 -0.209445
C  2.057572 0.311399 -0.032079
C  4.881774 1.369359 0.62652
C  6.973199 -0.465039 0.034469
C  6.231927 1.713296 0.870826
C  7.273193 0.807926 0.579005
C  6.208597 -3.040778 -1.082773
H  -7.272227 -2.130887 -0.229049
H  -7.219853 -0.321631 -1.966257
H  -7.146053 0.926391 -0.65547
H  -9.644583 -1.730414 0.530161
H  -9.435029 -1.231093 -1.173295
H  -9.496281 0.001962 0.12375
H  -7.662625 -1.561334 2.194409
H  -7.475242 0.180823 1.824351
H  -6.086411 -0.928261 1.638621
H  -2.673681 2.343691 0.403847
H  -3.431446 -1.585471 -1.243361
H  -0.193583 1.878108 0.41894
H  -0.977175 -2.069476 -1.237645
H  1.148059 -1.408342 -0.796137
H  3.267805 -1.320316 -0.595528
H  4.067984 2.061861 0.847381
H  7.782212 -1.166017 -0.191188
H  6.462942 2.697314 1.291795
H  8.316146 1.081006 0.770366
H  6.903353 -2.656322 -1.853609
H  6.778313 -3.344288 -0.183862
H  5.653236 -3.903322 -1.479768
