program: Gaussian 09
title: 000295390
version: EM64L-G09RevD.01
frameworkgroup: C1[X(C13H11ClN2O4S)]
method: RPBEPBE
basis: SDD
operation: Freq
keyword: #p
keyword: freq=noraman
keyword: PBEPBE/SDD
title: #p freq=noraman PBEPBE/SDD
converged: YES YES NO NO
title: Mulliken charges:
elementType: Cl S O O O O N N C C C C C C C C C C C C C H H H H H H H H H H H
charge: -0.059412 0.958102 -0.520422 -0.496133 -0.192664 -0.185740 -0.545331 0.025809 -0.050266 0.228374 0.404831 -0.328574 -0.272822 -0.342321 0.397266 -0.273816 -0.825678 -0.169522 -0.210156 -0.349583 -0.244891 0.312421 0.334849 0.299635 0.297207 0.264108 0.250214 0.230776 0.256796 0.245780 0.297300 0.263865
chargesum: 0.00000
title: Mulliken charges with hydrogens summed into heavy atoms:
elementType: Cl S O O O O N N C C C C C C C C C C C C C
charge: -0.059412 0.958102 -0.520422 -0.496133 -0.192664 -0.185740 -0.232910 0.025809 -0.050266 0.228374 0.404831 0.006275 0.026812 -0.045115 0.397266 -0.273816 -0.080580 0.087274 0.035624 -0.052283 0.018974
polarizability: 1.99673033e+02 2.15867851e+01 2.26977242e+02 -1.56153192e+01 -8.10120679e+00 2.06881691e+02
1716.lowfreq: -7.0147 -5.6098 -3.0443 -0.0013 0.0012 0.0014 10.6664 14.9707 25.7013
frequency: 9.3816 14.9254 25.6324 51.6190 71.1140 73.1334 100.4173 118.0727 122.7608 159.2208 166.8991 191.5676 196.6167 213.6104 232.1721 235.4408 262.8366 302.7694 333.5615 359.8728 366.8399 394.4370 399.4034 425.2188 436.2961 480.7718 502.5088 507.0453 513.4648 516.1659 570.2517 619.7253 633.4271 668.2861 681.0667 702.1246 709.6478 766.2112 787.3272 795.2988 808.3509 820.8956 822.2041 847.8717 908.9807 936.8773 958.4548 963.0383 979.4258 982.1046 1001.2399 1008.9550 1037.6427 1048.2088 1067.1215 1080.1050 1096.0584 1130.5786 1170.6112 1189.7485 1212.2190 1213.3482 1241.5354 1266.9017 1274.7665 1371.9618 1376.9766 1400.8812 1401.0232 1423.0023 1426.6621 1444.7845 1446.8984 1472.8608 1484.5546 1556.3527 1581.9993 1598.7733 1598.8958 2971.0344 3042.2929 3113.5369 3149.7748 3154.1080 3168.3406 3173.1056 3176.5212 3184.2964 3188.9157 3409.4076
redmass: 6.1562 10.9702 6.5843 12.4718 5.6780 6.7390 11.2288 1.1766 3.6050 8.6318 5.8662 5.3277 10.3048 8.0661 4.9454 8.4640 5.1465 5.1418 6.6238 5.3826 11.5999 7.1132 4.3380 3.7819 8.7612 3.1952 3.3391 5.4979 7.1022 4.8235 5.6347 6.2063 7.2608 3.6921 9.0333 3.6357 2.4969 1.9716 2.4729 6.8195 2.5962 1.4051 4.7869 4.3214 1.4089 1.4170 2.0401 2.8435 4.9561 1.4394 1.7243 1.3639 1.5032 2.0623 2.1588 1.9874 2.3526 2.0204 1.1275 1.3720 8.0308 2.0309 2.3039 1.3251 1.6974 4.3389 8.2707 1.4396 4.2420 3.0436 2.1511 2.3523 2.5595 1.2263 1.0583 5.9148 6.8770 7.3543 7.0635 1.0407 1.0979 1.0942 1.0894 1.0878 1.0934 1.0929 1.0929 1.0997 1.0971 1.0753
irintensity: 0.5279 0.2003 3.2483 1.4532 1.8923 1.2277 2.5394 1.5229 0.2501 4.7318 2.3023 2.3302 2.2013 2.4888 4.5413 3.4002 4.4007 15.4512 1.9258 1.8891 29.7964 0.2499 9.5063 14.7881 74.0397 28.5992 1.3783 37.4683 8.1989 24.6516 11.8329 10.4299 7.4513 13.1121 9.9460 27.2013 7.6865 70.0643 35.5615 15.1054 13.7918 39.6048 145.0741 53.4003 2.3662 4.3929 20.4402 38.8635 1.8406 2.3350 50.4139 1.7356 4.5202 20.5818 4.9474 20.3307 16.0331 10.1608 13.8111 2.6174 195.9982 12.1362 1.9176 0.3395 0.8921 6.2095 69.3587 12.3605 11.6728 56.9383 24.5955 19.4415 9.3776 27.7732 17.7270 27.3647 4.1230 2.3332 1.1416 14.9734 17.1562 3.3322 3.7837 5.1891 6.2813 0.5309 11.6019 3.9124 2.5825 24.4574
temp: 298.150 k
press: 1.00000 atm
elementType: 17 16 8 8 8 8 7 7 6 6 6 6 6 6 6 6 6 6 6 6 6 1 1 1 1 1 1 1 1 1 1 1
symmnumber: 1
zpe: 574813.7 jmol-1
zpe.correction: 0.218935 hartree
zpe.thermalcorrener: 0.239381 hartree
zpe.thermalcorrenthalpy: 0.240326 hartree
zpe.thermalcorrgfe: 0.166052 hartree
zpe.sumelectzpe: -1768.733410 hartree
zpe.sumelectthermal: -1768.712964 hartree
zpe.sumelectthermalent: -1768.712019 hartree
zpe.sumelectthermalfe: -1768.786293 hartree
dipole: -1.1413 -0.9613 -4.6747
dipole: 4.9071
quadrupole: -138.1476 -166.4446 -127.0628
quadrupole: -2.4493 -13.9007 -3.3498
quadrupole: 5.7374 -22.5596 16.8222 -2.4493 -13.9007 -3.3498
hfenergy: -1768.9523451 hartree
pointgroup: C01 [X(C13H11Cl1N2O4S1)]
dipole: 0.0188121 -0.2986771 1.9072622 debye
polarizability: 193.8001035|-12.6980933|238.9880363|-13.1339776|7.057102|200.7438263 unknown
InChI: InChI=1S/C13H11ClN2O4S/c1-9-12(14)6-3-7-13(9)15-21(19,20)11-5-2-4-10(8-11)16(17)18/h2-8,15H,1H3
charge 0 multiplicity 1
32 atoms
Cl 2.953411 -2.773986 2.052051
S  0.057227 2.589214 -0.544997
O  -0.1667 3.98113 0.26341
O  0.032661 2.47037 -2.159086
O  -3.681543 -2.707765 -0.449462
O  -2.204747 -2.072842 -2.069826
N  1.817037 1.993282 0.022778
N  -2.804208 -1.901849 -0.942566
C  -1.216255 1.333331 0.110927
C  2.106989 0.613975 -0.15316
C  2.291373 -0.255013 0.978475
C  -1.511059 0.214486 -0.678764
C  -1.817866 1.599003 1.353626
C  2.241072 0.134959 -1.485338
C  -2.458531 -0.687194 -0.149576
C  2.648649 -1.590547 0.684732
C  2.123922 0.271685 2.389696
C  -2.773039 0.676118 1.840136
C  2.554207 -1.217077 -1.715469
C  -3.093763 -0.478172 1.093558
C  2.773132 -2.0920 -0.626736
H  1.888169 2.354496 0.989813
H  -1.057087 0.048545 -1.660113
H  -1.569045 2.5147 1.901014
H  2.107748 0.838433 -2.312202
H  2.186177 -0.542938 3.126289
H  2.911946 1.005615 2.647973
H  1.142994 0.768537 2.519955
H  -3.268607 0.861047 2.797804
H  2.651731 -1.59232 -2.738678
H  -3.825458 -1.208858 1.448197
H  3.041564 -3.139063 -0.790362
