program: Gaussian 09
title: 000295356
version: EM64L-G09RevD.01
frameworkgroup: C1[X(C15H22N2O3)]
method: RPBEPBE
basis: SDD
operation: Freq
keyword: #p
keyword: freq=noraman
keyword: PBEPBE/SDD
title: #p freq=noraman PBEPBE/SDD
converged: YES YES NO NO
title: Mulliken charges:
elementType: O O O N N C C C C C C C C C C C C C C C H H H H H H H H H H H H H H H H H H H H H H
charge: -0.283931 -0.267051 -0.289269 -0.419395 -0.489589 -0.352554 -0.347475 -0.291513 -0.359113 -0.339279 -0.689538 0.234725 0.485180 0.173579 -0.337837 -0.342136 -0.450761 -0.332408 -0.688217 0.293044 0.203042 0.230147 0.191982 0.201488 0.216559 0.224895 0.208415 0.261741 0.204454 0.226778 0.215498 0.216549 0.210931 0.286715 0.267990 0.268758 0.217367 0.309518 0.288753 0.203735 0.207626 0.230599
chargesum: 0.00000
title: Mulliken charges with hydrogens summed into heavy atoms:
elementType: O O O N N C C C C C C C C C C C C C C C
charge: -0.283931 -0.267051 -0.289269 -0.132680 -0.200836 0.080635 0.045995 0.149941 0.111043 0.091953 -0.046561 0.234725 0.485180 0.173579 -0.069847 -0.073378 -0.233394 -0.022890 -0.046258 0.293044
polarizability: 3.37009889e+02 -5.92262569e+00 1.71381454e+02 1.67000290e+01 1.15279229e+01 1.20591855e+02
1716.lowfreq: -18.5526 -14.4869 -1.7526 -0.0010 0.0004 0.0007 3.6009 13.6193 30.9695
frequency: -14.3554 7.8988 30.9676 40.5018 49.4347 55.3129 69.6883 72.7337 88.1031 100.5869 112.6408 136.6450 160.7791 191.1772 213.2765 224.4940 226.8113 262.0482 288.5992 290.5703 304.5435 364.8032 365.1223 378.7598 407.4361 413.2563 442.4966 492.9499 504.2841 516.1515 596.2918 625.0413 644.7677 679.0361 698.7554 705.4938 741.3506 747.1886 756.7461 769.2084 808.6303 831.1186 836.1994 870.4164 878.4891 879.6792 894.8833 914.1270 941.1070 960.7384 977.3251 1003.0169 1005.4320 1021.0897 1030.3398 1060.3471 1077.2675 1092.8132 1115.4509 1120.3277 1122.7094 1133.1695 1163.5340 1182.5265 1208.0942 1226.8215 1248.9784 1253.1381 1271.1043 1272.7756 1283.9207 1288.8820 1291.2912 1307.0775 1341.0974 1345.8693 1357.9324 1368.8622 1370.1292 1386.8625 1388.8900 1425.7180 1450.9235 1451.7137 1463.4428 1471.2035 1474.9376 1477.4895 1477.9559 1481.8489 1488.9280 1489.1954 1496.3429 1511.1288 1583.5708 1613.3190 1623.7515 1650.9304 2966.8799 2970.9270 2974.7593 2987.3073 2989.7410 2992.1061 3012.3199 3017.4512 3040.2350 3052.5641 3068.4988 3072.5000 3075.0161 3075.3251 3080.1467 3096.9203 3110.4085 3160.5001 3170.6719 3197.4174 3520.8664 3554.0316
redmass: 3.2914 3.7260 4.1619 4.7729 3.6206 2.4123 2.9254 4.5176 4.1024 2.3996 2.5553 4.0396 3.4441 3.6619 3.9959 1.1601 1.2439 3.7155 3.6664 3.2078 3.6485 3.9512 2.3741 1.8249 2.9725 2.9849 4.1792 3.0833 4.4713 2.9823 1.2287 6.5938 5.6457 4.3214 3.5057 9.2700 1.4747 1.5706 4.5505 1.6771 1.3681 4.1802 1.4339 2.2395 1.4988 1.8666 2.0738 4.4667 1.2096 2.4597 1.3580 3.4559 1.3295 2.1993 3.3565 4.4155 2.4233 2.4312 2.4982 1.6144 2.1968 1.8533 1.7293 1.1774 1.8824 1.3211 1.2652 2.5024 1.6899 1.3095 1.5247 1.1549 1.0694 1.4843 1.4079 1.4422 1.3771 1.4060 3.2690 1.2163 1.2354 4.7059 1.1050 1.1203 1.0761 1.0662 1.0429 1.0653 1.0543 1.3230 1.1384 1.3238 1.8143 3.1239 5.3765 9.4943 5.9312 4.5571 1.0585 1.0363 1.0363 1.0619 1.0660 1.0605 1.0991 1.0580 1.0985 1.1025 1.1003 1.1008 1.0998 1.0980 1.0992 1.1082 1.0897 1.0946 1.0903 1.0956 1.0761 1.0771
irintensity: 0.1151 0.1313 4.4672 0.0359 6.2838 0.7093 3.2252 0.8030 4.9936 1.6210 1.6832 0.6033 0.1578 0.8103 0.7943 0.8658 0.3624 10.4400 2.6615 5.8520 6.6246 5.5154 29.5929 19.3071 13.4839 0.0074 3.0496 1.0137 14.9918 37.2064 134.1949 1.5352 0.8891 36.0536 7.8403 7.4912 11.9890 1.1337 15.0476 22.6398 1.3174 0.9571 29.9931 8.6802 50.6168 4.6266 16.4165 10.0913 0.3785 15.6219 0.1661 47.8985 1.3199 17.9880 2.8334 421.1383 7.9111 3.2253 11.2265 11.0939 3.7663 0.9068 62.3466 212.5020 361.4854 10.2494 102.1749 266.4531 154.4673 61.2097 24.1164 0.3373 4.0716 69.8300 7.6042 11.2660 11.1849 3.0683 119.2941 10.2484 24.3786 16.6960 47.7167 24.8510 8.1513 0.0654 12.7563 3.3114 17.6956 126.7520 17.4647 21.6668 641.5710 389.9657 7.9957 279.9189 100.8678 194.0258 34.7287 33.1077 34.2782 29.8053 54.0859 18.7042 10.6225 60.7494 3.6011 4.1779 95.2450 60.5293 56.4784 36.2060 19.6091 38.2777 21.8618 5.2561 1.4176 4.7627 5.3250 26.2598
temp: 298.150 k
press: 1.00000 atm
elementType: 8 8 8 7 7 6 6 6 6 6 6 6 6 6 6 6 6 6 6 6 1 1 1 1 1 1 1 1 1 1 1 1 1 1 1 1 1 1 1 1 1 1
symmnumber: 1
zpe: 919494.1 jmol-1
zpe.correction: 0.350217 hartree
zpe.thermalcorrener: 0.371316 hartree
zpe.thermalcorrenthalpy: 0.372260 hartree
zpe.thermalcorrgfe: 0.296748 hartree
zpe.sumelectzpe: -918.483691 hartree
zpe.sumelectthermal: -918.462592 hartree
zpe.sumelectthermalent: -918.461648 hartree
zpe.sumelectthermalfe: -918.537161 hartree
dipole: 4.1358 1.5368 1.1448
dipole: 4.5582
quadrupole: -83.5926 -121.7324 -120.7616
quadrupole: 20.6231 8.0994 4.3618
quadrupole: 25.1029 -13.0369 -12.0660 20.6231 8.0994 4.3618
hfenergy: -918.8339083 hartree
pointgroup: C01 [X(C15H22N2O3)]
dipole: -1.6289289 -0.5586334 0.5005048 debye
polarizability: 337.8249095|-4.9280952|166.549837|-10.587443|-18.9584076|124.6084507 unknown
InChI: InChI=1S/C15H22N2O3/c1-3-5-11-20-14(18)12-6-8-13(9-7-12)17-15(19)16-10-4-2/h6-9,16-17H,3-5,10-11H2,1-2H3
charge 0 multiplicity 1
42 atoms
O  3.435074 0.596162 -0.942496
O  3.575619 -1.561217 -0.054723
O  -3.437636 1.806406 -0.380867
N  -5.039724 0.354092 0.50566
N  -2.793873 -0.31385 0.455134
C  5.664628 1.029602 0.098649
C  7.18917 1.115311 -0.151254
C  4.91009 0.581374 -1.160638
C  -6.165157 1.263997 0.23061
C  -6.976647 0.885027 -1.031476
C  7.966623 1.556845 1.107403
C  1.415521 -0.435467 -0.173122
C  -1.397609 -0.301041 0.225574
C  2.883505 -0.554837 -0.362298
C  0.72175 -1.526985 0.413081
C  0.682986 0.719285 -0.553084
C  -0.664658 -1.46204 0.610691
C  -0.708112 0.797547 -0.361711
C  -7.668961 -0.49141 -0.933094
C  -3.735183 0.696038 0.151183
H  5.282502 2.018005 0.420557
H  5.46132 0.312951 0.916321
H  7.390089 1.826096 -0.97892
H  7.563094 0.126937 -0.487418
H  5.059306 1.285497 -1.996635
H  5.214324 -0.438127 -1.46035
H  -6.830029 1.281826 1.116576
H  -5.729382 2.270097 0.107414
H  -7.738983 1.673119 -1.192023
H  -6.301646 0.910875 -1.907622
H  7.810488 0.843371 1.937856
H  9.052662 1.615099 0.910086
H  7.630781 2.552695 1.452755
H  -5.250046 -0.566398 0.893086
H  1.29158 -2.415219 0.704565
H  1.217511 1.560015 -1.003929
H  -1.189551 -2.312801 1.064872
H  -1.272482 1.684127 -0.654211
H  -3.148014 -1.163881 0.899605
H  -6.930246 -1.309374 -0.832708
H  -8.352135 -0.535246 -0.062982
H  -8.26635 -0.701399 -1.838317
