program: Gaussian 09
title: 000295375
version: EM64L-G09RevD.01
frameworkgroup: C1[X(C21H19NO4)]
method: RPBEPBE
basis: SDD
operation: Freq
keyword: #p
keyword: freq=noraman
keyword: PBEPBE/SDD
title: #p freq=noraman PBEPBE/SDD
converged: YES YES NO NO
title: Mulliken charges:
elementType: O O O O N C C C C C C C C C C C C C C C C C C C C C H H H H H H H H H H H H H H H H H H H
charge: -0.284853 -0.335994 -0.319333 -0.268457 -0.442381 -0.407080 0.417580 0.363265 0.303730 0.362612 -0.413875 -0.389506 -0.329234 -0.356631 0.175947 -0.317658 -0.388065 -0.319629 -0.224543 -0.218401 -0.322022 -0.240213 -0.234831 -0.249653 0.231768 -0.527609 0.222075 0.223485 0.228193 0.262807 0.249849 0.252791 0.301132 0.254676 0.299129 0.367607 0.226585 0.226126 0.240136 0.228519 0.227791 0.226002 0.226788 0.226854 0.244521
chargesum: 0.00000
title: Mulliken charges with hydrogens summed into heavy atoms:
elementType: O O O O N C C C C C C C C C C C C C C C C C C C C C
charge: -0.284853 -0.335994 -0.319333 -0.268457 -0.074774 0.038480 0.417580 0.363265 0.303730 0.362612 -0.185683 -0.126698 -0.079386 -0.103840 0.175947 -0.016526 -0.133389 -0.020500 0.002041 0.007725 -0.081886 -0.011694 -0.007040 -0.023651 0.231768 0.170554
polarizability: 4.43334335e+02 8.18852524e+00 2.52920379e+02 -3.67462150e+00 6.38802745e+00 1.09757186e+02
1716.lowfreq: -11.8379 -6.7216 -2.5518 -2.2091 -0.0013 0.0006 0.0015 11.7194 17.6025
frequency: -5.9150 11.6922 16.7977 30.8981 35.6381 63.2012 67.9661 77.4092 93.9652 100.1248 110.8791 164.0705 172.7826 187.4513 193.4471 230.7837 236.5596 262.4756 284.8531 309.0687 316.6249 344.0923 362.8459 401.4415 416.0355 448.4900 454.2419 475.3615 484.7746 488.2852 513.8519 553.6011 557.9931 580.2987 614.4950 620.6181 626.1655 671.0626 702.0257 709.0534 711.1047 726.9815 727.4541 743.3009 749.8168 760.4442 775.1508 806.2679 813.0228 830.3904 832.5439 852.2735 855.7145 863.9126 912.4902 933.6941 947.3937 959.7681 960.3026 978.9212 979.1308 982.6142 989.9979 995.2973 995.8345 1000.6245 1014.9021 1027.7348 1041.6551 1085.2381 1108.4935 1112.6995 1116.0486 1147.5825 1159.8978 1163.3099 1172.3026 1175.0321 1182.6357 1186.4950 1202.5487 1206.0117 1223.2438 1234.5369 1256.3651 1297.0634 1307.9234 1313.1148 1355.7775 1378.2712 1391.0693 1396.4831 1421.1448 1428.2974 1440.0750 1450.8655 1463.8360 1465.7223 1468.6232 1480.7294 1485.8850 1490.3598 1521.0382 1589.3537 1596.0380 1604.8357 1613.3211 1618.5635 1619.6969 1669.8433 2932.5622 2966.3082 2992.7961 3056.6136 3114.2247 3127.7697 3128.0747 3137.1480 3141.5541 3154.7267 3156.0941 3158.5705 3159.7709 3170.5074 3171.7436 3176.9949 3190.7260 3205.7015 3516.8791
redmass: 3.7971 6.0646 3.7271 5.6714 6.7909 7.5270 5.2894 4.5708 3.8155 4.1965 5.6410 5.6418 5.9626 2.3586 4.8453 3.3048 1.5978 4.1176 6.4126 3.8829 5.7238 5.9137 7.3387 2.8334 3.1218 3.5616 3.2821 7.0317 3.8990 5.7638 2.5230 5.3250 3.8608 6.1575 6.6890 6.9039 6.6119 6.8526 2.2320 4.2556 6.2774 2.8409 4.5052 1.5716 1.3697 1.3038 6.0721 5.2667 1.2633 4.0987 1.7017 1.3869 1.2502 6.2380 1.3319 1.3518 1.3308 6.1324 1.4271 1.4100 1.2976 6.9494 6.1419 8.3312 1.3448 2.6473 1.7407 2.1358 2.0554 1.5733 2.0005 1.3086 1.2586 1.7184 2.2536 1.6777 1.0542 1.0899 1.6796 1.1373 2.4487 1.2315 2.0055 4.7095 1.9247 1.2800 1.7163 1.3900 1.7559 6.3702 3.7561 6.3800 3.6790 1.4812 2.1319 1.8635 1.4832 1.0555 1.2179 1.3045 2.3341 2.0640 2.7611 7.8941 6.2205 5.9653 6.4799 6.2107 6.1962 9.8601 1.0577 1.0325 1.1025 1.1044 1.0874 1.0868 1.1000 1.0858 1.0928 1.0913 1.0880 1.0973 1.0899 1.0971 1.0980 1.0975 1.0956 1.0944 1.0759
irintensity: 1.9291 0.6012 0.5316 0.5321 0.2997 0.7963 0.2140 1.2896 9.4565 0.1680 2.2617 2.0197 2.5603 5.3193 1.8089 3.9335 1.6747 4.3785 0.8728 1.3307 2.8057 5.9627 0.2137 0.7324 0.0243 3.8565 7.8296 19.1811 8.0980 3.3162 17.7908 6.6007 1.3887 6.3131 1.7416 6.8418 0.4658 1.6172 32.6514 0.8148 4.0815 3.1184 23.7634 59.1924 21.7055 192.0408 24.6808 0.6274 4.1281 17.4274 89.8182 1.6025 0.2732 9.5133 5.7019 7.4942 2.5114 205.2361 20.3401 3.7611 2.2714 159.2126 0.4372 72.3392 0.4627 69.8385 5.4318 9.5447 17.7481 12.0535 65.7705 23.4271 0.1966 406.6198 746.4063 21.9037 0.0740 22.1260 304.7223 14.3752 118.8316 4.2704 28.6063 42.6898 76.0594 0.5508 32.6412 13.3700 24.3719 14.7505 29.7674 62.9942 32.9739 107.4601 21.8954 130.1692 309.2712 20.8016 85.1043 127.7363 12.2043 340.9174 404.1149 11.5390 0.8386 24.1961 99.0860 33.3754 8.7050 227.6092 26.7440 70.4824 30.0325 43.1723 9.6061 0.7992 18.4008 0.7955 29.7348 20.8988 10.7921 36.4744 14.6674 19.8369 9.3674 4.0313 6.1465 6.5387 83.4965
temp: 298.150 k
press: 1.00000 atm
elementType: 8 8 8 8 7 6 6 6 6 6 6 6 6 6 6 6 6 6 6 6 6 6 6 6 6 6 1 1 1 1 1 1 1 1 1 1 1 1 1 1 1 1 1 1 1
symmnumber: 1
zpe: 921240.0 jmol-1
zpe.correction: 0.350882 hartree
zpe.thermalcorrener: 0.373290 hartree
zpe.thermalcorrenthalpy: 0.374234 hartree
zpe.thermalcorrgfe: 0.295635 hartree
zpe.sumelectzpe: -1165.431336 hartree
zpe.sumelectthermal: -1165.408928 hartree
zpe.sumelectthermalent: -1165.407984 hartree
zpe.sumelectthermalfe: -1165.486583 hartree
dipole: -2.2628 1.8621 0.1320
dipole: 2.9334
quadrupole: -101.2839 -134.2634 -159.2842
quadrupole: -21.7617 1.2492 1.8691
quadrupole: 30.3266 -2.6529 -27.6737 -21.7617 1.2492 1.8691
hfenergy: -1165.782218 hartree
pointgroup: C01 [X(C21H19N1O4)]
dipole: 0.88953 -0.4075466 0.6120365 debye
polarizability: 443.3311709|8.374442|157.488089|-3.6815194|-67.7753614|205.1926399 unknown
InChI: InChI=1S/C21H19NO4/c1-24-20-10-6-5-9-19(20)22-21(23)26-18-13-11-17(12-14-18)25-15-16-7-3-2-4-8-16/h2-14,22H,15H2,1H3
charge 0 multiplicity 1
45 atoms
O  -4.041502 -0.447434 0.322017
O  1.592935 -0.464024 0.475408
O  5.858886 -1.146057 1.374492
O  2.273296 1.036805 -1.249012
N  3.781346 -0.13588 0.145341
C  -4.805406 0.43063 -0.576374
C  -6.285829 0.235417 -0.309293
C  -2.639395 -0.363456 0.267229
C  5.041377 0.298993 -0.33235
C  0.179188 -0.358656 0.321536
C  -7.21941 0.512431 -1.338632
C  -6.757582 -0.175776 0.960875
C  -1.912041 0.477801 -0.608061
C  -1.946262 -1.207372 1.171431
C  6.180885 -0.24919 0.334451
C  -0.497024 0.485415 -0.584873
C  -0.542752 -1.204156 1.197904
C  5.234359 1.211708 -1.394321
C  -8.606818 0.393721 -1.099815
C  -8.145009 -0.302709 1.197005
C  7.485494 0.109643 -0.054422
C  -9.074376 -0.014741 0.170728
C  6.546643 1.569683 -1.782015
C  7.666667 1.02526 -1.119931
C  2.537573 0.238844 -0.317745
C  6.963032 -1.756895 2.115343
H  -4.564981 0.193165 -1.633268
H  -4.509584 1.485233 -0.38379
H  -6.864186 0.818799 -2.330972
H  -6.033082 -0.407943 1.746902
H  -2.421322 1.134253 -1.319505
H  -2.522915 -1.854618 1.838556
H  0.063888 1.131196 -1.26101
H  0.008316 -1.848595 1.888974
H  4.360846 1.627581 -1.900452
H  3.808922 -0.803559 0.92201
H  -9.318883 0.610428 -1.904006
H  -8.50059 -0.626888 2.181671
H  8.356165 -0.310997 0.457264
H  -10.149837 -0.112623 0.356461
H  6.686175 2.277337 -2.605746
H  8.680656 1.305518 -1.423811
H  7.604191 -2.361768 1.445974
H  7.574139 -0.986678 2.623583
H  6.486807 -2.407743 2.863053
