program: Gaussian 09
title: 000295346
version: EM64L-G09RevD.01
frameworkgroup: C1[X(C15H16ClN3O)]
method: RPBEPBE
basis: SDD
operation: Freq
keyword: #p
keyword: freq=noraman
keyword: PBEPBE/SDD
title: #p freq=noraman PBEPBE/SDD
converged: YES YES NO NO
title: Mulliken charges:
elementType: Cl O N N N C C C C C C C C C C C C C C C H H H H H H H H H H H H H H H H
charge: -0.075564 -0.290241 -0.155137 -0.499839 -0.513038 0.417697 0.494325 -0.336372 -0.347746 -0.490340 -0.352565 -0.646953 -0.646782 0.503367 0.270147 -0.444830 -0.346759 -0.038829 -0.192123 -0.265838 0.236259 0.236596 0.208238 0.299591 0.286208 0.229736 0.216790 0.230233 0.215116 0.233376 0.232525 0.290300 0.243226 0.312998 0.230364 0.255865
chargesum: 0.00000
title: Mulliken charges with hydrogens summed into heavy atoms:
elementType: Cl O N N N C C C C C C C C C C C C C C C
charge: -0.075564 -0.290241 -0.155137 -0.213630 -0.222737 0.417697 0.494325 -0.100113 -0.111150 -0.282102 -0.052974 0.029805 0.034235 0.503367 0.270147 -0.201604 -0.033761 -0.038829 0.038241 -0.009973
polarizability: 4.08612099e+02 1.04438130e+00 1.95876389e+02 1.38065595e-02 1.08295019e-01 8.60567464e+01
1716.lowfreq: -10.8326 -3.1375 -0.6318 -0.0020 -0.0017 -0.0011 10.6072 22.1041 49.4254
frequency: 9.3906 22.0462 49.4205 52.4493 63.4584 76.8546 85.6355 126.1874 129.2600 178.2045 181.3968 207.4888 221.2855 224.5720 226.4824 266.8238 339.7755 360.1496 366.9540 389.8000 410.4271 415.9463 434.1836 453.8914 475.0584 505.0304 523.8969 565.3807 598.2283 610.3479 632.0752 663.5214 682.9850 689.3492 720.0965 723.3677 773.1871 785.5425 793.1798 816.4027 826.1663 853.6494 889.3917 907.5146 915.5058 944.6859 971.9684 976.7074 990.1096 991.8269 1012.1611 1055.6206 1071.8756 1096.4846 1109.0122 1110.8312 1137.8029 1163.8357 1175.0033 1179.1883 1206.9362 1247.1974 1266.7453 1268.7072 1308.5116 1322.2957 1359.0042 1365.0525 1380.2063 1411.5235 1424.4999 1439.0550 1458.0220 1462.4259 1473.1668 1474.6819 1492.3363 1505.6838 1507.4747 1510.5485 1529.0566 1580.9043 1586.7548 1614.6122 1643.0748 1648.8050 2929.5234 2939.7070 2990.8389 2997.7709 3091.4509 3099.6381 3101.8753 3139.4969 3145.0884 3160.8715 3168.6186 3180.5876 3195.7035 3202.3687 3519.3396 3531.6991
redmass: 4.5105 4.7516 6.2607 4.8384 4.8538 2.9617 2.7768 1.8498 7.0854 5.4875 5.4125 1.1061 2.1275 4.6078 2.7473 5.7695 6.2528 2.9297 5.7940 4.0877 8.3599 3.0735 2.7012 1.9505 3.6382 3.9788 2.2110 3.7141 5.6637 1.2770 7.1734 6.9900 2.3673 10.3976 3.4539 5.3840 7.1727 1.3054 1.3981 6.6590 1.5892 1.6123 6.0734 1.3644 1.3826 3.1761 1.3065 5.8658 1.3067 3.5969 4.6050 1.4870 1.9495 1.5739 1.3114 1.2439 1.4280 1.8534 1.2673 1.6920 1.1509 1.8592 2.8987 1.7003 1.7153 1.5768 3.0961 4.1138 6.0873 3.6883 1.6562 1.8430 1.2232 1.0410 1.0466 2.6881 1.1661 1.4355 2.2014 1.3626 2.7769 4.7945 5.1045 6.4792 5.8100 4.0526 1.0372 1.0395 1.1001 1.1016 1.0955 1.0899 1.0934 1.0921 1.0890 1.0888 1.0921 1.0955 1.0946 1.0951 1.0765 1.0755
irintensity: 0.0620 0.4235 0.0417 0.1997 12.5160 2.4093 5.3661 0.0707 5.5671 1.2908 0.7750 0.0034 2.4452 1.1433 0.2534 7.7959 0.2558 5.2512 8.3208 7.8672 4.7403 0.0025 6.8562 0.7227 3.4721 14.4016 28.7318 8.5971 0.7928 129.3060 0.6738 13.4385 33.6777 12.3738 0.0690 5.8205 0.6652 53.9252 34.8021 33.4656 72.8918 51.4291 6.8670 4.5458 2.2854 38.1139 3.5830 21.4032 5.0303 5.9582 25.0319 26.9434 19.1503 21.9147 0.9910 0.0908 8.4944 112.2570 109.3540 217.5603 7.5493 171.1256 46.7202 49.7811 52.9108 116.9030 84.9289 220.3022 86.4641 15.2199 38.2205 17.8439 79.8733 0.2789 21.1049 418.0803 80.6089 277.9369 687.0363 25.1475 328.7600 189.1221 39.9763 156.4205 111.9170 121.8528 129.9307 120.3846 34.1275 68.6473 5.2416 36.0930 41.8910 8.6389 9.9194 15.0407 17.5431 2.5943 7.5604 11.2018 10.3242 14.9970
temp: 298.150 k
press: 1.00000 atm
elementType: 17 8 7 7 7 6 6 6 6 6 6 6 6 6 6 6 6 6 6 6 1 1 1 1 1 1 1 1 1 1 1 1 1 1 1 1
symmnumber: 1
zpe: 742348.2 jmol-1
zpe.correction: 0.282746 hartree
zpe.thermalcorrener: 0.302196 hartree
zpe.thermalcorrenthalpy: 0.303140 hartree
zpe.thermalcorrgfe: 0.231622 hartree
zpe.sumelectzpe: -1279.307905 hartree
zpe.sumelectthermal: -1279.288455 hartree
zpe.sumelectthermalent: -1279.287511 hartree
zpe.sumelectthermalfe: -1279.359029 hartree
dipole: -5.2591 -2.5540 0.0201
dipole: 5.8465
quadrupole: -105.6630 -111.3179 -132.7511
quadrupole: 5.0309 0.0133 -0.0302
quadrupole: 10.9144 5.2594 -16.1738 5.0309 0.0133 -0.0302
hfenergy: -1279.5906504 hartree
pointgroup: C01 [X(C15H16Cl1N3O1)]
dipole: 2.1067267 0.9210311 0.0657542 debye
polarizability: 408.3690158|-7.2004316|195.6492547|-0.995809|7.1728908|86.5269633 unknown
InChI: InChI=1S/C15H16ClN3O/c1-19(2)14-8-6-12(7-9-14)17-15(20)18-13-5-3-4-11(16)10-13/h3-10,17-18H,1-2H3
charge 0 multiplicity 1
36 atoms
Cl -7.103821 1.653327 0.114357
O  -0.668622 -1.316143 -0.077983
N  5.925383 -0.221498 -0.023582
N  0.313642 0.821641 0.066193
N  -2.010638 0.62618 0.048521
C  4.544034 0.016071 -0.002469
C  1.706155 0.496222 0.039334
C  4.017898 1.342574 0.0979
C  3.598801 -1.054316 -0.080678
C  2.630772 1.568969 0.117306
C  2.210837 -0.825669 -0.060394
C  6.862486 0.90075 0.078339
C  6.430171 -1.593982 -0.132096
C  -3.31131 0.061601 0.018041
C  -0.771514 -0.056645 0.005576
C  -4.407052 0.970032 0.0709
C  -3.562946 -1.336324 -0.060323
C  -5.715789 0.464772 0.044691
C  -4.895282 -1.797525 -0.084044
C  -5.99692 -0.911644 -0.032263
H  4.68862 2.203691 0.159628
H  3.945115 -2.088647 -0.158277
H  2.265648 2.602595 0.194449
H  1.511884 -1.661607 -0.120068
H  0.118559 1.822146 0.141941
H  6.746964 1.616623 -0.762403
H  7.89585 0.519846 0.055247
H  6.730625 1.466178 1.024608
H  7.531687 -1.580329 -0.140569
H  6.089798 -2.086536 -1.066326
H  6.104873 -2.225157 0.721047
H  -1.98879 1.646474 0.104958
H  -4.239328 2.051343 0.131483
H  -2.720343 -2.027243 -0.101579
H  -5.082781 -2.875037 -0.144546
H  -7.027069 -1.275834 -0.050916
