program: Gaussian 09
title: 000295340
version: EM64L-G09RevD.01
frameworkgroup: C1[X(C13H21N3O)]
method: RPBEPBE
basis: SDD
operation: Freq
keyword: #p
keyword: freq=noraman
keyword: PBEPBE/SDD
title: #p freq=noraman PBEPBE/SDD
converged: YES YES NO NO
title: Mulliken charges:
elementType: O N N N C C C C C C C C C C C C C H H H H H H H H H H H H H H H H H H H H H
charge: -0.308287 -0.163559 -0.489275 -0.423463 0.470547 -0.397144 -0.396893 -0.356272 -0.365373 -0.664896 -0.664391 0.491284 -0.501847 -0.376087 0.288600 -0.334132 -0.652485 0.219435 0.218524 0.223778 0.216624 0.224150 0.224497 0.216791 0.238331 0.209583 0.213930 0.242151 0.210678 0.205980 0.301622 0.280110 0.209342 0.261888 0.276261 0.236346 0.197804 0.215849
chargesum: 0.00000
title: Mulliken charges with hydrogens summed into heavy atoms:
elementType: O N N N C C C C C C C C C C C C C
charge: -0.308287 -0.163559 -0.209165 -0.147202 0.470547 0.040815 0.043509 -0.132122 -0.140876 -0.000191 0.002367 0.491284 -0.295867 -0.074465 0.288600 0.137097 -0.002486
polarizability: 2.89882296e+02 -4.24030200e+00 1.60195198e+02 -2.72035304e+00 -1.08413764e+01 1.04050201e+02
1716.lowfreq: -8.0540 -2.9131 -0.0002 0.0005 0.0008 8.1546 24.5357 28.6981 50.8377
frequency: 24.4973 28.6835 50.6888 57.9265 65.3652 73.6635 94.9977 104.7190 112.8103 150.2554 192.7802 203.1360 211.6634 239.3820 255.4037 298.3793 320.4519 326.8998 355.3220 363.7537 403.1548 417.5678 421.7548 450.2260 510.5691 535.1958 536.6090 570.6635 629.9651 680.6939 696.7124 710.1261 717.3850 782.5664 783.7789 788.6930 802.8487 823.2086 825.1654 889.7341 903.9873 909.1472 919.6791 970.4526 976.1489 995.7308 1014.3494 1070.9019 1077.1148 1078.1651 1094.1029 1127.6703 1134.2849 1135.6919 1159.8034 1201.4752 1208.2243 1214.9807 1261.6287 1272.5623 1287.0396 1290.6433 1320.1843 1342.0746 1352.5971 1357.2002 1368.2972 1382.4094 1384.6859 1386.7503 1397.7368 1428.6597 1462.6331 1464.2044 1466.9667 1470.5469 1474.2721 1478.9121 1481.0455 1484.2388 1490.0681 1502.7775 1508.7444 1524.3116 1580.4848 1636.7681 1643.2406 2977.3005 2978.9545 2979.9403 2980.5158 2984.7344 2985.8341 3028.2219 3034.7121 3061.5518 3075.3588 3075.6259 3081.3210 3088.6565 3091.5699 3094.7673 3097.3886 3153.7327 3160.6687 3188.7391 3525.2820 3546.3176
redmass: 3.3086 3.2806 3.9742 3.1277 4.2611 3.2843 3.7789 3.2126 2.6338 3.2510 1.3448 1.1681 1.1826 3.0294 1.8930 1.8829 3.0054 2.0911 2.8913 4.3918 2.9629 3.8398 2.8858 2.6043 2.4853 2.7996 2.9313 1.2184 6.6814 3.7561 10.5838 3.2236 3.5788 1.2446 1.1349 1.4199 1.4120 2.0880 2.3492 2.2853 2.3398 1.4102 2.1174 1.3081 3.9772 2.9527 2.9394 2.1170 1.8371 2.3581 1.6426 2.0617 1.9553 1.5994 1.9534 1.1882 2.4032 1.8318 1.5621 1.7965 1.1723 1.2323 1.4560 1.2864 1.3508 1.4281 2.8826 1.2159 1.2265 1.2231 2.1969 3.5165 1.1791 1.0541 1.0450 1.0561 1.0601 1.1376 1.0484 1.3617 1.0837 1.2044 2.4173 2.5086 5.0712 4.1677 6.4794 1.0369 1.0539 1.0409 1.0375 1.0666 1.0598 1.1028 1.1019 1.0973 1.0995 1.0993 1.0962 1.1009 1.1005 1.1013 1.0894 1.0886 1.0921 1.0947 1.0761 1.0768
irintensity: 1.5853 1.1848 8.5662 0.4439 2.8197 0.5990 3.3835 1.8823 2.7815 0.1423 0.2474 2.6446 1.5969 0.3087 0.3479 7.7712 0.5539 15.5780 16.8610 2.6035 1.9658 15.7018 14.0027 2.8816 32.3453 8.3883 6.1517 156.7369 2.8638 2.2783 9.5973 5.1838 0.0844 19.4288 5.3937 36.4288 11.1025 39.5733 21.0614 0.1216 12.8971 3.5545 4.1690 4.5504 0.5974 1.0039 36.8758 14.6407 24.0003 11.7077 18.4569 6.9952 0.2856 0.4707 39.6141 85.7164 53.5922 381.2860 120.6151 6.8264 78.8646 5.3466 74.3489 35.1439 102.8341 3.3141 61.8008 9.5701 40.7782 22.1379 25.6097 6.3793 90.8753 2.9717 11.4231 17.8288 0.5821 28.6767 1.7493 67.9273 34.6245 1.5913 709.2499 511.5519 56.6403 139.7408 27.9250 34.8323 72.8802 21.0163 28.5298 96.9616 38.2239 7.0957 23.5977 18.1926 29.1730 69.7880 36.5454 32.0174 64.9693 37.6833 28.0885 21.4796 19.9243 8.3242 6.7600 16.6913
temp: 298.150 k
press: 1.00000 atm
elementType: 8 7 7 7 6 6 6 6 6 6 6 6 6 6 6 6 6 1 1 1 1 1 1 1 1 1 1 1 1 1 1 1 1 1 1 1 1 1
symmnumber: 1
zpe: 851694.4 jmol-1
zpe.correction: 0.324393 hartree
zpe.thermalcorrener: 0.343436 hartree
zpe.thermalcorrenthalpy: 0.344380 hartree
zpe.thermalcorrgfe: 0.275304 hartree
zpe.sumelectzpe: -746.166413 hartree
zpe.sumelectthermal: -746.147371 hartree
zpe.sumelectthermalent: -746.146427 hartree
zpe.sumelectthermalfe: -746.215503 hartree
dipole: -0.9520 -3.4470 1.2085
dipole: 3.7747
quadrupole: -74.0495 -96.6963 -108.6339
quadrupole: -13.5137 2.9268 -2.7092
quadrupole: 19.0771 -3.5697 -15.5073 -13.5137 2.9268 -2.7092
hfenergy: -746.4908066 hartree
pointgroup: C01 [X(C13H21N3O1)]
dipole: 0.3775441 1.2728424 0.6654021 debye
polarizability: 289.9293761|-4.0300254|155.8195393|0.2184857|18.5635878|108.3787792 unknown
InChI: InChI=1S/C13H21N3O/c1-4-14-13(17)15-11-7-9-12(10-8-11)16(5-2)6-3/h7-10,14-15H,4-6H2,1-3H3
charge 0 multiplicity 1
38 atoms
O  -3.060782 -1.199993 -0.837177
N  3.519947 -0.209568 -0.092244
N  -2.116696 0.755201 0.096508
N  -4.441713 0.544458 -0.110085
C  2.130684 0.012608 -0.052452
C  4.468871 0.748212 0.500517
C  4.087175 -1.4088 -0.733726
C  1.579357 1.22728 0.463734
C  1.197545 -0.963076 -0.525103
C  4.871433 1.902944 -0.450277
C  4.163616 -2.641958 0.199873
C  -0.721315 0.460404 0.024195
C  0.188896 1.436865 0.503152
C  -0.193009 -0.749053 -0.495792
C  -3.188144 -0.047567 -0.317361
C  -5.685453 -0.162588 -0.447897
C  -6.48896 -0.602203 0.795072
H  4.045477 1.159075 1.437151
H  5.376892 0.189006 0.797178
H  3.502049 -1.655712 -1.639931
H  5.105178 -1.156911 -1.088353
H  2.232275 2.025238 0.82813
H  1.552026 -1.92073 -0.917296
H  5.352958 1.507063 -1.362852
H  3.98748 2.48611 -0.762258
H  5.584746 2.587804 0.046244
H  4.800714 -2.429532 1.077805
H  3.161748 -2.920709 0.569768
H  4.592277 -3.51069 -0.334709
H  -0.189893 2.385926 0.907663
H  -0.880386 -1.512546 -0.865087
H  -2.339271 1.673088 0.486835
H  -6.309979 0.47977 -1.099993
H  -5.381485 -1.044933 -1.036298
H  -4.517016 1.450785 0.35399
H  -5.886581 -1.282323 1.422101
H  -6.791504 0.264455 1.413266
H  -7.408258 -1.134797 0.488206
