program: Gaussian 09
title: 000295332
version: EM64L-G09RevD.01
frameworkgroup: C1[X(C16H15Cl2NO2)]
method: RPBEPBE
basis: SDD
operation: Freq
keyword: #p
keyword: freq=noraman
keyword: PBEPBE/SDD
title: #p freq=noraman PBEPBE/SDD
converged: YES YES NO NO
title: Mulliken charges:
elementType: Cl Cl O O N C C C C C C C C C C C C C C C C H H H H H H H H H H H H H H H
charge: -0.017537 -0.042543 -0.277703 -0.247411 -0.452382 0.285028 0.316638 0.469615 -0.531072 -0.341456 -0.440431 -0.846540 0.149426 -0.813431 -0.460367 0.509064 -0.306179 -0.301393 -0.196312 -0.222232 -0.112956 0.233178 0.300792 0.232797 0.378908 0.236789 0.232300 0.243818 0.229064 0.226095 0.230003 0.247007 0.271600 0.271702 0.283742 0.262376
chargesum: 0.00000
title: Mulliken charges with hydrogens summed into heavy atoms:
elementType: Cl Cl O O N C C C C C C C C C C C C C C C C
charge: -0.017537 -0.042543 -0.277703 -0.247411 -0.073474 0.285028 0.316638 0.469615 -0.297894 -0.040664 -0.207633 -0.133633 0.149426 -0.128269 0.058240 0.509064 -0.306179 -0.029690 0.087430 0.040144 -0.112956
polarizability: 2.36118167e+02 1.00457197e+00 1.88959121e+02 -5.89148226e+00 8.91022686e+00 2.01237810e+02
1716.lowfreq: -29.4598 -3.9323 -3.0346 -0.0022 -0.0022 -0.0016 5.1396 15.1534 19.7148
frequency: -29.3562 15.0963 19.5903 23.5881 55.8836 70.3515 83.3935 113.4195 162.3244 165.3831 174.5573 182.5591 196.9055 205.5241 210.4313 265.8553 287.6932 300.9575 333.1110 361.6163 368.2829 387.8987 421.7874 430.5189 440.2427 444.9879 466.7038 536.9313 547.2860 548.2407 573.4476 588.6401 616.4933 636.9622 682.2027 697.9116 713.1769 726.6032 754.7158 793.0853 805.0516 830.4648 845.1863 863.9953 889.3325 904.2379 934.6257 943.0752 976.3762 977.7348 981.3203 999.9814 1017.2272 1029.2443 1041.2353 1049.2727 1086.3535 1124.0664 1153.1305 1170.7855 1196.0659 1210.0222 1230.9354 1232.9178 1254.8014 1290.6358 1299.0873 1323.4065 1361.3322 1374.0254 1386.2304 1396.4259 1400.4277 1415.6976 1454.4638 1460.6548 1465.6683 1470.0484 1475.0069 1481.6500 1501.2565 1526.0762 1572.0959 1592.8728 1601.1692 1623.6352 1627.9957 2959.7661 2974.5842 3029.4870 3029.6768 3051.8820 3082.8922 3088.4778 3098.1139 3113.6594 3131.1367 3161.5607 3180.8172 3182.8901 3187.9818 3482.3525
redmass: 1.0278 8.3790 6.6164 4.6504 7.3248 6.1571 5.9284 6.2098 3.0433 4.1591 11.5394 1.9322 4.9765 6.0571 1.8871 3.4426 3.7113 4.3853 7.3986 5.8298 4.3647 8.6737 5.5881 4.0759 3.3816 3.1059 3.8702 4.8796 3.9927 4.0941 3.5952 4.4192 6.4565 4.6252 6.9797 4.1031 5.6011 2.2943 1.3758 7.0670 1.4164 4.9827 1.3327 1.3856 1.2947 4.3167 1.3414 4.5988 1.6060 4.9743 1.3521 2.0773 1.5085 4.0411 1.5197 1.5611 2.4968 2.0811 1.3117 1.5819 1.8600 2.6302 1.7301 1.7463 1.3501 2.8435 1.6073 1.2950 4.8534 5.2705 5.2865 1.2490 1.2772 3.1263 1.9828 1.2149 1.6189 1.0464 1.1159 1.0471 1.6793 2.1709 7.4836 7.5752 4.9560 5.6684 6.9680 1.0399 1.0373 1.0661 1.0892 1.0976 1.0986 1.0954 1.1067 1.0913 1.0911 1.0886 1.0948 1.0955 1.0945 1.0755
irintensity: 0.3043 0.0503 0.5704 1.0492 4.0680 2.9376 0.4655 0.2585 3.0560 0.7419 0.9685 0.5062 3.7805 11.1490 2.5778 1.1858 1.6254 4.0834 3.7232 1.2440 1.7554 1.4830 13.4701 13.2048 3.1811 6.3731 8.1917 0.4183 3.9232 5.1709 5.1688 6.9112 32.7157 10.0075 37.0014 2.1087 0.1572 14.4964 75.7003 29.8918 58.3589 5.0003 52.5325 20.0598 0.9864 4.4334 0.8845 25.8259 14.2975 20.7323 6.9199 8.6941 1.6005 86.5474 1.2680 15.9143 38.1562 2.6550 3.8090 8.1752 30.0452 34.0222 110.8835 6.7435 48.2549 4.3347 18.2369 1.9860 17.4700 21.2678 2.3654 8.6491 14.5653 3.3004 254.9922 80.9582 59.7209 13.6377 17.2901 12.0640 31.0749 327.9393 20.8192 4.7094 45.8426 185.6760 31.5672 27.1366 43.3428 14.9980 25.6059 21.6677 17.8560 16.0567 6.9002 22.9134 18.6101 2.8189 0.0213 1.3065 3.5471 48.5699
temp: 298.150 k
press: 1.00000 atm
elementType: 17 17 8 8 7 6 6 6 6 6 6 6 6 6 6 6 6 6 6 6 6 1 1 1 1 1 1 1 1 1 1 1 1 1 1 1
symmnumber: 1
zpe: 713015.8 jmol-1
zpe.correction: 0.271573 hartree
zpe.thermalcorrener: 0.291259 hartree
zpe.thermalcorrenthalpy: 0.292203 hartree
zpe.thermalcorrgfe: 0.220260 hartree
zpe.sumelectzpe: -1742.521200 hartree
zpe.sumelectthermal: -1742.501514 hartree
zpe.sumelectthermalent: -1742.500570 hartree
zpe.sumelectthermalfe: -1742.572514 hartree
dipole: 0.7063 0.5636 1.3521
dipole: 1.6262
quadrupole: -137.4655 -137.0356 -136.6048
quadrupole: 9.8960 6.6030 1.0486
quadrupole: -0.4302 -0.0003 0.4305 9.8960 6.6030 1.0486
hfenergy: -1742.7927733 hartree
pointgroup: C01 [X(C16H15Cl2N1O2)]
dipole: -0.419727 -0.0519996 0.4800557 debye
polarizability: 231.59678|-3.3551864|185.998543|11.5650279|-6.9903808|208.7197761 unknown
InChI: InChI=1S/C16H15Cl2NO2/c1-10-3-5-14(11(2)7-10)19-16(20)9-21-15-6-4-12(17)8-13(15)18/h3-8,19H,9H2,1-2H3
charge 0 multiplicity 1
36 atoms
Cl 2.188361 1.323169 3.193608
Cl 4.346098 -3.213909 0.821056
O  1.515014 2.105731 0.429605
O  -0.462084 2.102327 -2.654764
N  -1.008326 1.51237 -0.425725
C  -2.870847 0.355985 0.651272
C  -2.283865 0.88267 -0.542416
C  -4.833329 -0.38719 -0.675459
C  -4.134298 -0.265538 0.553976
C  -2.961158 0.773966 -1.782165
C  -4.2220 0.143221 -1.836423
C  -2.159084 0.456476 1.991283
C  -0.205757 2.044734 -1.414638
C  -6.190308 -1.06697 -0.732763
C  1.101849 2.66382 -0.871675
C  2.155467 0.855178 0.435737
C  2.558117 0.358928 1.702746
C  2.417993 0.073679 -0.716031
C  3.223535 -0.872177 1.833342
C  3.086071 -1.166011 -0.603627
C  3.483452 -1.619245 0.666415
H  -4.588711 -0.670614 1.467503
H  -2.496435 1.180899 -2.682379
H  -4.736125 0.065928 -2.801667
H  -0.608419 1.564385 0.51766
H  -1.174324 -0.052281 1.983188
H  -1.988966 1.507434 2.300278
H  -2.758828 -0.017783 2.785134
H  -6.922037 -0.56551 -0.071454
H  -6.602037 -1.057831 -1.756467
H  -6.127573 -2.122258 -0.405616
H  1.89181 2.563863 -1.636092
H  0.943048 3.735786 -0.665312
H  2.093792 0.408164 -1.705242
H  3.52838 -1.234265 2.818256
H  3.284123 -1.765733 -1.495843
