program: Gaussian 09
title: 000295338
version: EM64L-G09RevD.01
frameworkgroup: C1[X(C13H11BrClNO2S)]
method: RPBEPBE
basis: SDD
operation: Freq
keyword: #p
keyword: freq=noraman
keyword: PBEPBE/SDD
title: #p freq=noraman PBEPBE/SDD
converged: YES YES NO NO
title: Mulliken charges:
elementType: Br Cl S O O N C C C C C C C C C C C C C H H H H H H H H H H H
charge: 0.053094 -0.065562 0.992360 -0.529532 -0.499339 -0.754028 0.381618 -0.015393 0.324089 -0.304916 -0.374767 -0.234945 -0.221912 -0.823848 -0.107138 -0.261052 -0.157342 -0.163554 -0.212021 0.366450 0.290248 0.289850 0.289573 0.237393 0.240027 0.241210 0.228354 0.257775 0.265615 0.267692
chargesum: 0.00000
title: Mulliken charges with hydrogens summed into heavy atoms:
elementType: Br Cl S O O N C C C C C C C C C C C C C
charge: 0.053094 -0.065562 0.992360 -0.529532 -0.499339 -0.387579 0.381618 -0.015393 0.324089 -0.014668 -0.137373 0.054905 0.067661 -0.114257 -0.107138 -0.003278 0.108273 0.104138 -0.212021
polarizability: 2.32677952e+02 5.19815159e+00 2.13714187e+02 8.44574350e-01 2.11247255e+01 1.70500705e+02
1716.lowfreq: -7.9076 0.0018 0.0021 0.0022 1.6590 6.4592 14.5342 17.9557 35.7437
frequency: 14.5032 17.6520 35.7391 60.9233 81.8888 108.0004 111.4633 130.6658 180.8931 184.2767 190.8793 200.8825 226.8722 231.3450 255.9307 272.9688 301.9985 337.8045 347.6677 357.8180 362.5840 389.7265 406.5510 430.5199 440.8252 472.7398 508.3876 551.4436 576.1106 610.1282 625.9399 683.4280 702.0508 705.7269 730.1663 770.6735 803.1601 803.6816 829.3329 835.8538 878.9108 888.4357 936.4271 946.0086 960.8452 974.5587 977.7416 987.6052 1044.6592 1045.5707 1054.8014 1083.1316 1108.3966 1124.5225 1179.3586 1182.4252 1253.3958 1274.7751 1284.0341 1318.0829 1374.7826 1377.1237 1377.9553 1396.5082 1407.0586 1446.9544 1471.3954 1478.8255 1483.2066 1561.4858 1573.5747 1590.8459 1607.0273 2959.2726 3032.1424 3091.4640 3135.2910 3158.8076 3162.7574 3169.8599 3180.0194 3180.2579 3183.2302 3508.9213
redmass: 10.9872 5.7105 4.2288 7.3654 12.4028 6.4693 5.5145 7.0252 5.8330 1.7999 3.3106 5.2938 6.0639 6.0749 4.1897 5.1318 3.6508 5.9315 2.5889 7.5567 5.5211 3.0371 2.8674 4.5000 3.1021 6.4090 3.6229 5.1993 5.1745 7.1065 6.8619 6.9549 4.0294 3.8344 4.6985 4.8622 1.3274 10.7142 1.2663 1.4333 1.9593 2.6099 1.3469 13.2971 1.3421 1.4089 6.6767 1.5461 1.5163 5.4971 1.9660 2.2001 1.3449 1.6611 1.1570 1.7450 2.5451 1.3261 1.2314 1.6318 2.8289 5.5528 6.8861 1.9257 1.8326 2.0825 1.0650 2.6080 1.1327 6.1041 7.5967 8.1287 6.6843 1.0410 1.0951 1.0966 1.0900 1.0897 1.0897 1.0924 1.0964 1.0956 1.0975 1.0773
irintensity: 0.1484 0.6297 0.0180 2.3319 0.7342 1.9706 0.6931 0.8876 6.0834 4.0200 0.7726 1.1335 2.7078 2.5140 30.2528 3.5331 4.5982 73.8512 8.9565 12.4382 3.0859 22.8622 0.2618 13.1306 6.2697 82.2417 121.8329 3.2252 9.7495 0.6655 39.5072 15.4913 12.9070 32.7003 131.9165 3.7765 57.3547 130.3994 5.3276 41.0441 46.0009 91.3196 0.4110 59.0055 0.2583 0.7390 42.8850 25.7172 7.8206 67.7379 12.2443 7.0378 3.6181 28.6713 10.8208 5.1118 19.3511 14.5957 1.5593 56.7347 16.5167 8.5263 0.6000 34.8699 38.8466 51.8039 16.8567 120.7504 20.3538 42.5653 20.4809 0.6883 113.7173 30.8890 19.0712 18.6184 13.5798 2.0271 1.8908 1.8646 0.2386 3.0352 2.4033 54.5733
temp: 298.150 k
press: 1.00000 atm
elementType: 35 17 16 8 8 7 6 6 6 6 6 6 6 6 6 6 6 6 6 1 1 1 1 1 1 1 1 1 1 1
symmnumber: 1
zpe: 546105.2 jmol-1
zpe.correction: 0.208000 hartree
zpe.thermalcorrener: 0.227161 hartree
zpe.thermalcorrenthalpy: 0.228105 hartree
zpe.thermalcorrgfe: 0.157125 hartree
zpe.sumelectzpe: -1577.223185 hartree
zpe.sumelectthermal: -1577.204025 hartree
zpe.sumelectthermalent: -1577.203081 hartree
zpe.sumelectthermalfe: -1577.274061 hartree
dipole: -0.9382 -0.5095 4.8574
dipole: 4.9733
quadrupole: -130.0592 -145.1137 -135.1405
quadrupole: 1.8109 13.4154 11.4270
quadrupole: 6.7119 -8.3426 1.6306 1.8109 13.4154 11.4270
hfenergy: -1577.4311856 hartree
pointgroup: C01 [X(C13H11Br1Cl1N1O2S1)]
dipole: -0.5728339 -1.256645 1.3860621 debye
polarizability: 228.5142938|3.6148409|184.1468124|6.3045104|30.7098366|204.2317377 unknown
InChI: InChI=1S/C13H11BrClNO2S/c1-9-2-5-11(15)8-13(9)16-19(17,18)12-6-3-10(14)4-7-12/h2-8,16H,1H3
charge 0 multiplicity 1
30 atoms
Br -5.024643 -2.370646 -1.799647
Cl 3.301108 -1.682432 -2.255934
S  -0.469369 2.079082 -0.068548
O  -1.176075 3.209362 0.8618
O  0.371616 2.460121 -1.406175
N  0.543093 1.208264 1.163213
C  1.492085 0.185967 0.91856
C  -1.748211 0.78278 -0.560074
C  2.011798 -0.513098 2.056347
C  1.901078 -0.161726 -0.395282
C  2.929178 -1.562042 1.826274
C  -2.839699 0.589746 0.302229
C  -1.586787 0.108852 -1.780002
C  1.580114 -0.134556 3.459596
C  2.796117 -1.231849 -0.55974
C  3.327687 -1.948577 0.52522
C  -3.819757 -0.355924 -0.071495
C  -2.569116 -0.838878 -2.147803
C  -3.666187 -1.060565 -1.287323
H  0.575915 1.768216 2.022294
H  1.571942 0.424872 -1.256786
H  -2.938306 1.171317 1.224107
H  -0.739665 0.327567 -2.436875
H  3.334702 -2.104608 2.687944
H  0.479111 -0.173834 3.56988
H  2.019064 -0.818894 4.203905
H  1.902767 0.890783 3.733897
H  4.027262 -2.773204 0.368151
H  -4.686616 -0.534451 0.570058
H  -2.477709 -1.387547 -3.088691
