program: Gaussian 09
title: 000295331
version: EM64L-G09RevD.01
frameworkgroup: C1[X(C15H12Cl3NO2)]
method: RPBEPBE
basis: SDD
operation: Freq
keyword: #p
keyword: freq=noraman
keyword: PBEPBE/SDD
title: #p freq=noraman PBEPBE/SDD
converged: YES YES NO NO
title: Mulliken charges:
elementType: Cl Cl Cl O O N C C C C C C C C C C C C C C C H H H H H H H H H H H H
charge: -0.059743 -0.016056 -0.038472 -0.279702 -0.239369 -0.463226 0.346216 0.276915 -0.292597 -0.372510 -0.458071 0.159846 -0.838967 -0.108538 -0.258408 0.510569 -0.306662 -0.303169 -0.194646 -0.219802 -0.114492 0.384573 0.328039 0.237018 0.249082 0.275438 0.235385 0.246048 0.239562 0.257829 0.269390 0.284759 0.263760
chargesum: 0.00000
title: Mulliken charges with hydrogens summed into heavy atoms:
elementType: Cl Cl Cl O O N C C C C C C C C C C C C C C C
charge: -0.059743 -0.016056 -0.038472 -0.279702 -0.239369 -0.078653 0.346216 0.276915 0.035442 -0.135492 0.066450 0.159846 -0.117973 -0.108538 -0.000578 0.510569 -0.306662 -0.033779 0.090113 0.043957 -0.114492
polarizability: 2.38943185e+02 -1.15515278e+01 1.87893786e+02 -1.55240717e+01 1.57723884e+01 1.89681738e+02
1716.lowfreq: -3.8336 0.0006 0.0013 0.0016 3.7059 5.2358 13.8643 18.1418 22.0831
frequency: 13.8302 17.8965 22.0253 58.9666 77.6355 92.6780 99.1149 114.5569 163.7820 172.8985 180.4632 189.8296 197.2713 242.6645 259.7597 276.6304 304.0492 321.3104 337.7344 359.4445 365.8221 387.9244 421.8940 432.7366 440.8460 452.6683 494.9149 548.3083 550.6581 579.7436 596.8389 618.9495 630.9267 661.6657 684.3658 697.4476 714.7180 760.8386 786.8562 795.0142 803.1996 809.8484 864.6425 884.0492 920.0786 930.2621 933.1353 943.2816 979.5250 988.3458 1001.2480 1029.2502 1042.6491 1079.8316 1086.5828 1130.2442 1152.9730 1185.4171 1197.0305 1209.1267 1230.2490 1253.0257 1271.3312 1275.2898 1323.0587 1361.6823 1373.4925 1386.5364 1398.6360 1412.1578 1453.2367 1459.4482 1463.8160 1481.8666 1483.7273 1522.3832 1572.2908 1589.3878 1595.4128 1610.6584 1628.2773 2962.1416 3031.0331 3032.5033 3092.4560 3099.0246 3137.9909 3161.9182 3177.8295 3181.5450 3183.6014 3193.3129 3477.6459
redmass: 10.7583 9.3257 7.1239 10.8161 6.8384 6.3713 6.9186 4.7119 6.3022 12.6694 10.3181 4.2886 1.1759 5.0116 3.8075 7.9890 4.7362 3.9413 7.0585 10.0490 6.3851 8.8240 4.5126 4.3519 3.8234 3.0561 4.6462 4.2242 4.2070 5.1197 4.3503 6.9394 6.5192 5.6708 6.9942 4.0391 2.7412 1.2651 5.0891 7.0374 1.4225 1.2922 1.3872 6.2553 1.3723 5.6686 1.3438 1.3437 6.1635 1.5981 2.1184 4.0104 1.5263 2.1149 2.4909 1.6950 1.3075 2.2449 1.8856 2.5493 1.6929 1.3497 1.9989 1.5374 1.2900 4.9133 6.2834 5.2991 1.3519 3.1513 2.0942 1.1988 1.9313 1.0674 1.3702 2.1406 7.5595 6.3528 6.8330 5.2946 6.7127 1.0401 1.0580 1.0978 1.0953 1.1067 1.0899 1.0886 1.0958 1.0945 1.0957 1.0935 1.0757
irintensity: 0.5617 0.5690 1.2364 5.1907 0.7051 0.9001 0.3688 0.0315 0.1892 1.1542 5.9096 3.1996 0.0512 0.6598 3.2219 8.9693 6.3196 1.6925 3.6117 6.2498 1.5041 1.4143 0.4739 20.0568 0.4193 11.7355 26.2188 4.2727 5.4584 3.3101 1.0391 38.3461 8.9782 6.6978 37.7684 2.2877 13.7353 79.3073 8.9676 23.4959 55.9076 48.4179 20.5843 65.9276 28.5666 5.0485 0.4554 0.8547 27.9400 31.1277 6.9146 89.2972 5.3904 4.4275 40.0227 9.1572 3.6907 22.4521 31.5778 24.0747 120.3887 48.8615 18.0964 2.7079 2.5908 16.1666 17.6366 2.0372 7.0208 55.7200 230.1407 71.2026 102.6985 16.7554 54.7300 341.0319 16.1957 81.2790 56.7151 18.9555 166.1809 24.9464 17.5906 18.1754 16.3064 6.2396 12.1767 3.2070 2.8167 0.0553 1.3949 12.6921 59.6240
temp: 298.150 k
press: 1.00000 atm
elementType: 17 17 17 8 8 7 6 6 6 6 6 6 6 6 6 6 6 6 6 6 6 1 1 1 1 1 1 1 1 1 1 1 1
symmnumber: 1
zpe: 617113.8 jmol-1
zpe.correction: 0.235046 hartree
zpe.thermalcorrener: 0.254954 hartree
zpe.thermalcorrenthalpy: 0.255898 hartree
zpe.thermalcorrgfe: 0.182997 hartree
zpe.sumelectzpe: -2162.681609 hartree
zpe.sumelectthermal: -2162.661701 hartree
zpe.sumelectthermalent: -2162.660757 hartree
zpe.sumelectthermalfe: -2162.733658 hartree
dipole: 1.9891 -2.0475 -1.4121
dipole: 3.1848
quadrupole: -163.0811 -144.2576 -136.5724
quadrupole: 6.7032 12.1029 2.2435
quadrupole: -15.1108 3.7128 11.3980 6.7032 12.1029 2.2435
hfenergy: -2162.9166552 hartree
pointgroup: C01 [X(C15H12Cl3N1O2)]
dipole: -0.3708801 -0.125191 1.1902776 debye
polarizability: 217.7529988|-9.9499843|175.1061858|-25.0347898|5.910772|223.6595242 unknown
InChI: InChI=1S/C15H12Cl3NO2/c1-9-2-3-11(17)7-13(9)19-15(20)8-21-14-5-4-10(16)6-12(14)18/h2-7,19H,8H2,1H3
charge 0 multiplicity 1
33 atoms
Cl 5.040261 -0.107672 -3.494365
Cl -2.115377 -1.409544 3.177172
Cl -4.330433 3.174335 0.952946
O  -1.529641 -2.145064 0.382944
O  0.421333 -2.122229 -2.716224
N  0.981433 -1.567745 -0.482954
C  2.263307 -0.959948 -0.598489
C  2.865336 -0.458544 0.599354
C  2.923597 -0.855141 -1.850743
C  4.139914 0.142052 0.497248
C  -1.148048 -2.681654 -0.935015
C  0.165415 -2.076767 -1.477523
C  2.160328 -0.56208 1.941283
C  4.187825 -0.245239 -1.886792
C  4.819742 0.259705 -0.736834
C  -2.164137 -0.890562 0.428923
C  -2.527037 -0.416948 1.716172
C  -2.456659 -0.087548 -0.700101
C  -3.184626 0.813049 1.888706
C  -3.117379 1.151637 -0.54545
C  -3.476698 1.582158 0.743796
H  0.583332 -1.624982 0.461164
H  2.447214 -1.24242 -2.752821
H  4.61611 0.53119 1.404115
H  -1.944496 -2.550427 -1.68751
H  -1.006063 -3.76108 -0.756801
H  1.971234 -1.61306 2.238081
H  2.774251 -0.110268 2.737049
H  1.186433 -0.033311 1.945587
H  5.805135 0.728802 -0.796739
H  -2.164157 -0.404487 -1.704844
H  -3.459412 1.157769 2.888583
H  -3.339438 1.768118 -1.420417
