program: Gaussian 09
title: 000295303
version: EM64L-G09RevD.01
frameworkgroup: C1[X(C14H11ClN2O2)]
method: RPBEPBE
basis: SDD
operation: Freq
keyword: #p
keyword: freq=noraman
keyword: PBEPBE/SDD
title: #p freq=noraman PBEPBE/SDD
converged: YES YES NO NO
title: Mulliken charges:
elementType: Cl O O N N C C C C C C C C C C C C C C H H H H H H H H H H H
charge: -0.043573 -0.252622 -0.330788 -0.452279 -0.626581 0.345199 0.109634 0.347669 -0.334165 0.105628 -0.310875 -0.224033 -0.275082 -0.288526 -0.349427 0.199971 -0.219098 -0.231566 -0.214726 0.397723 0.316223 0.199628 0.234344 0.232805 0.266626 0.257295 0.236557 0.236830 0.324512 0.342698
chargesum: 0.00000
title: Mulliken charges with hydrogens summed into heavy atoms:
elementType: Cl O O N N C C C C C C C C C C C C C C
charge: -0.043573 -0.252622 -0.330788 -0.054555 0.040629 0.345199 0.109634 0.347669 -0.017943 0.105628 -0.111248 0.010311 -0.042276 -0.288526 -0.082801 0.199971 0.038197 0.004991 0.022104
polarizability: 2.76848210e+02 -3.48271634e-01 1.90045031e+02 2.39947015e+01 2.48800990e+00 1.00255298e+02
1716.lowfreq: -7.1994 -4.2057 -0.0022 -0.0008 0.0005 4.0770 26.7079 34.1254 45.1420
frequency: 26.6575 34.0377 45.1304 67.1391 101.5788 121.5878 131.9441 170.4721 192.7270 219.7299 273.9482 278.8006 306.4052 323.0299 392.1300 408.7059 409.1921 413.2499 466.3185 484.8235 494.0543 522.8546 534.7570 585.4046 586.0358 602.6356 642.3018 682.1131 693.3963 702.8484 735.3561 744.5796 756.5872 774.3238 785.7841 834.4647 867.7578 876.5629 884.8423 949.9733 953.9810 957.3708 990.7453 1008.0994 1018.0097 1032.8306 1040.7533 1047.6535 1088.9401 1120.3640 1123.3058 1150.7279 1172.8995 1182.0239 1239.3566 1256.4917 1275.3976 1312.9069 1346.3017 1367.5541 1398.0445 1418.2576 1435.7344 1451.5221 1459.7800 1509.7533 1556.3105 1569.8959 1579.1677 1600.5037 1609.7602 1616.4417 1645.9620 3119.0028 3127.1072 3139.6360 3141.4781 3152.9996 3165.8741 3166.6797 3177.3940 3192.6828 3536.4026 3689.4342
redmass: 6.4856 7.0528 5.9850 6.3403 5.0868 6.6554 6.1344 7.1013 6.2310 6.0032 6.1708 5.7060 6.3449 5.6892 8.6349 4.1358 5.5400 3.7932 4.0313 1.8107 2.0491 5.2610 3.0645 1.4734 3.4865 4.7346 6.5236 5.2393 4.0669 5.5391 4.6570 2.3535 1.7703 1.7858 2.5898 5.1104 4.0111 1.6677 1.4332 1.1802 1.3727 1.3916 1.3476 1.3194 6.0657 2.7578 2.0271 2.9772 2.5332 2.5300 1.6907 1.7914 1.0576 1.0807 2.0974 1.5721 1.8450 2.0994 4.4076 9.2392 6.9107 2.2316 2.5763 2.4908 2.7617 3.1642 4.5972 4.4328 7.2294 6.2249 2.6538 2.2003 2.0825 1.0847 1.0862 1.0859 1.0902 1.0905 1.0984 1.0953 1.1003 1.0953 1.0453 1.1037
irintensity: 1.3346 4.9747 1.7932 3.2987 5.7736 2.1793 2.8081 1.9822 2.1574 1.6373 2.6541 8.6979 2.1153 1.2752 2.8421 4.6632 10.1180 3.1195 13.4822 43.3579 84.0719 1.9464 10.9301 110.1530 10.0722 20.7909 11.4654 8.3488 51.4190 22.4786 8.2831 22.1078 81.1893 34.9570 15.6430 0.2690 44.3045 6.2739 4.6713 45.7864 12.3862 0.8894 0.9438 2.5954 59.1579 8.3949 8.4275 9.3075 0.0978 6.9519 6.1529 2.3068 1.5688 4.2790 20.0171 18.4476 33.0590 131.6076 440.4520 6.2035 98.3905 29.6383 7.2918 74.6054 42.0978 570.8186 208.9778 8.4652 207.3697 71.8017 183.2549 164.7832 37.1353 298.5114 30.0043 1.6181 14.3165 7.5041 24.2881 8.5483 17.2434 13.9470 64.1100 32.9380
temp: 298.150 k
press: 1.00000 atm
elementType: 17 8 8 7 7 6 6 6 6 6 6 6 6 6 6 6 6 6 6 1 1 1 1 1 1 1 1 1 1 1
symmnumber: 1
zpe: 581802.5 jmol-1
zpe.correction: 0.221597 hartree
zpe.thermalcorrener: 0.237956 hartree
zpe.thermalcorrenthalpy: 0.238900 hartree
zpe.thermalcorrgfe: 0.175986 hartree
zpe.sumelectzpe: -1258.818476 hartree
zpe.sumelectthermal: -1258.802117 hartree
zpe.sumelectthermalent: -1258.801173 hartree
zpe.sumelectthermalfe: -1258.864086 hartree
dipole: 2.7758 2.7625 -1.1061
dipole: 4.0694
quadrupole: -77.3421 -110.8027 -121.6062
quadrupole: 6.3014 5.1707 2.5737
quadrupole: 25.9082 -7.5523 -18.3559 6.3014 5.1707 2.5737
hfenergy: -1259.0400729 hartree
pointgroup: C01 [X(C14H11Cl1N2O2)]
dipole: -1.0894882 -1.1659134 -0.1301265 debye
polarizability: 275.051531|-6.124091|183.9320622|-29.1464007|-22.5748324|108.164945 unknown
InChI: InChI=1S/C14H11ClN2O2/c15-11-7-3-1-5-9(11)14(19)17-12-8-4-2-6-10(12)13(16)18/h1-8,17H,16H2
charge 0 multiplicity 1
30 atoms
Cl 1.797912 -1.153148 2.063044
O  0.771275 2.430776 -0.090702
O  -0.744796 -2.280794 -0.28613
N  -0.155718 0.260527 -0.042673
N  -2.836899 -3.014733 0.312554
C  -1.535797 0.531076 0.075835
C  -2.458074 -0.578552 0.098148
C  2.273661 0.540519 -0.164315
C  -2.04166 1.859602 0.17792
C  0.897491 1.166028 -0.071971
C  -3.850008 -0.302993 0.179313
C  -3.424912 2.08889 0.280158
C  -4.34201 1.01096 0.271146
C  2.784069 -0.477916 0.676362
C  3.150187 1.081133 -1.144686
C  -1.957603 -1.989785 0.025065
C  4.094532 -0.977217 0.533539
C  4.460265 0.590918 -1.309281
C  4.931341 -0.447985 -0.472694
H  0.042694 -0.760737 -0.156404
H  -1.330604 2.687022 0.164336
H  -4.575018 -1.123811 0.135802
H  -3.790568 3.118941 0.354257
H  -5.419683 1.194426 0.325039
H  2.773467 1.901033 -1.764591
H  4.453708 -1.75941 1.208295
H  5.110686 1.017673 -2.079431
H  5.948209 -0.837788 -0.587957
H  -3.77739 -2.863547 0.666692
H  -2.476757 -3.966207 0.247735
