program: Gaussian 09
title: 000295297
version: EM64L-G09RevD.01
frameworkgroup: C1[X(C15H14ClNO3)]
method: RPBEPBE
basis: SDD
operation: Freq
keyword: #p
keyword: freq=noraman
keyword: PBEPBE/SDD
title: #p freq=noraman PBEPBE/SDD
converged: NO YES NO NO
title: Mulliken charges:
elementType: Cl O O O N C C C C C C C C C C C C C C C H H H H H H H H H H H H H H
charge: -0.056656 -0.328221 -0.262988 -0.253643 -0.445806 0.506149 -0.395353 -0.463252 -0.323708 0.109827 0.323905 -0.325553 -0.353661 0.418368 -0.323550 -0.366668 -0.206101 -0.182144 -0.119215 -0.538389 0.354997 0.249057 0.248841 0.221055 0.307864 0.241358 0.252037 0.259954 0.249878 0.257051 0.258588 0.219808 0.219758 0.246411
chargesum: 0.00000
title: Mulliken charges with hydrogens summed into heavy atoms:
elementType: Cl O O O N C C C C C C C C C C C C C C C
charge: -0.056656 -0.328221 -0.262988 -0.253643 -0.090809 0.506149 0.102546 -0.242197 -0.015844 0.109827 0.323905 -0.084194 -0.101624 0.418368 -0.063596 -0.116790 0.050950 0.076443 -0.119215 0.147587
polarizability: 3.22742350e+02 1.35694664e+01 1.98000390e+02 2.00242183e-01 -2.03092735e-01 8.11490453e+01
1716.lowfreq: -0.0016 -0.0011 0.0012 2.8224 4.7563 10.3331 20.2955 32.1379 36.3490
frequency: 20.2812 32.0766 36.3460 51.9026 59.4099 106.5079 120.1685 126.2904 143.8297 150.3122 185.1697 219.5897 244.4417 253.5408 302.7858 317.5414 347.0341 379.7446 397.6528 415.6846 416.3920 426.2281 475.4619 496.8038 518.8878 523.2335 589.0681 611.6404 624.0670 637.7788 658.6164 694.6364 725.2126 752.2252 754.5221 805.1961 806.4882 807.9466 821.6358 847.6110 851.6040 922.9035 931.4105 945.6914 951.0186 986.4048 987.5228 989.1061 991.9999 1001.7119 1002.6847 1073.0401 1110.1580 1111.6110 1118.7559 1156.8909 1174.8133 1179.7501 1203.8594 1213.5565 1216.1124 1225.0796 1272.7984 1290.5657 1306.4565 1338.5366 1373.9688 1379.8783 1404.3538 1427.3343 1436.4748 1451.4216 1467.3251 1472.3326 1476.4275 1503.6946 1530.2674 1588.4733 1593.7743 1606.0297 1622.5019 1632.0222 2956.9704 2981.6827 3043.6756 3046.9608 3117.2742 3125.1954 3158.7378 3159.9088 3162.8660 3165.5549 3177.3455 3180.7359 3192.8736 3472.5783
redmass: 6.5820 3.5132 7.2321 5.4812 5.8874 4.1708 6.8793 6.2341 7.7548 3.1925 2.6468 3.9889 1.2837 8.5904 8.0359 7.0882 5.8705 5.3207 5.5516 2.9987 3.0324 9.0164 4.8492 2.7269 5.1573 2.4357 3.4871 5.8236 7.1089 6.8296 6.5153 3.5503 3.5410 5.2249 1.1765 1.2644 6.8504 1.3635 1.5648 5.8288 1.5023 1.3931 1.3372 6.1625 1.3482 1.3144 8.4682 6.6723 4.0886 2.5959 1.7908 2.6002 1.3014 1.2608 1.3176 1.3268 1.1946 1.2344 1.0685 3.2655 3.5412 2.8658 2.2979 1.2651 1.3787 1.4171 5.4761 6.3118 3.6587 3.9559 1.1703 1.1513 1.0501 1.0823 2.0975 2.4002 2.4260 7.3886 5.3153 6.4934 6.3796 6.5383 1.0332 1.0553 1.1039 1.1068 1.0898 1.0991 1.0885 1.0883 1.0905 1.0934 1.0968 1.0977 1.0958 1.0761
irintensity: 0.3949 2.6173 0.7716 0.3021 0.4328 10.4822 1.4346 0.0082 2.6640 10.3078 4.2130 6.2241 0.4399 1.5835 0.5305 1.2923 0.1412 1.5702 18.0811 0.0092 0.0042 6.6811 2.5029 22.9892 42.0734 25.7786 0.8168 10.7515 0.8354 6.1119 40.5341 0.0142 1.6451 19.2902 32.7605 13.5171 12.3380 44.6791 101.8002 4.8637 75.0678 3.2685 0.2033 19.6496 0.0989 2.4573 53.2304 83.5124 30.8598 14.3716 0.7030 46.5641 16.1798 0.2055 26.9723 2.9297 78.6465 69.8258 2.2223 54.2453 360.0623 108.1998 25.2339 0.3978 3.1272 2.0074 26.2748 53.9939 2.3604 8.3902 14.5284 132.7960 13.6710 115.9566 195.5292 120.5535 451.7942 16.9109 104.8760 29.7963 241.6436 10.6357 76.8074 19.5599 51.4451 15.1029 23.7802 22.0323 6.5795 4.1399 5.4922 10.6373 5.4741 0.7013 5.5699 104.7977
temp: 298.150 k
press: 1.00000 atm
elementType: 17 8 8 8 7 6 6 6 6 6 6 6 6 6 6 6 6 6 6 6 1 1 1 1 1 1 1 1 1 1 1 1 1 1
symmnumber: 1
zpe: 678083.1 jmol-1
zpe.correction: 0.258268 hartree
zpe.thermalcorrener: 0.276792 hartree
zpe.thermalcorrenthalpy: 0.277736 hartree
zpe.thermalcorrgfe: 0.208801 hartree
zpe.sumelectzpe: -1319.031184 hartree
zpe.sumelectthermal: -1319.012661 hartree
zpe.sumelectthermalent: -1319.011717 hartree
zpe.sumelectthermalfe: -1319.080651 hartree
dipole: -0.4999 -3.6552 0.0430
dipole: 3.6895
quadrupole: -128.6216 -116.3505 -128.8588
quadrupole: 24.9889 -0.0546 -0.0206
quadrupole: -4.0113 8.2598 -4.2485 24.9889 -0.0546 -0.0206
hfenergy: -1319.2894527 hartree
pointgroup: C01 [X(C15H14Cl1N1O3)]
dipole: 0.3731222 -0.2200398 -1.3854227 debye
polarizability: 324.1053054|-3.4177511|84.2586825|2.7418096|18.5093203|193.5277965 unknown
InChI: InChI=1S/C15H14ClNO3/c1-19-13-8-4-12(5-9-13)17-15(18)10-20-14-6-2-11(16)3-7-14/h2-9,17H,10H2,1H3
charge 0 multiplicity 1
34 atoms
Cl -7.26783 -0.019423 -1.967786
O  -1.632862 0.269011 0.158952
O  6.550114 0.11962 0.14494
O  0.582146 0.698396 3.01097
N  0.918809 0.321674 0.698749
C  2.338285 0.275786 0.580814
C  -1.35999 0.502673 1.584946
C  2.88756 0.06793 -0.707925
C  3.211608 0.427369 1.694409
C  0.156925 0.514643 1.829728
C  5.147833 0.159561 0.210472
C  4.283625 0.008643 -0.902054
C  4.601797 0.368274 1.501507
C  -2.975153 0.215962 -0.262504
C  -4.082356 0.384722 0.603282
C  -3.172563 -0.023207 -1.644065
C  -5.393565 0.312407 0.078053
C  -4.478744 -0.09536 -2.166516
C  -5.575181 0.073815 -1.295194
C  7.156626 -0.094342 -1.170075
H  0.370701 0.193196 -0.16014
H  -1.80482 -0.299683 2.205128
H  -1.772644 1.478368 1.907699
H  2.222049 -0.049498 -1.572659
H  2.790113 0.587923 2.68851
H  4.676461 -0.152527 -1.90998
H  5.287711 0.4826 2.346235
H  -3.949271 0.570413 1.672524
H  -2.302948 -0.150928 -2.295185
H  -6.256874 0.441287 0.736784
H  -4.639884 -0.280113 -3.232244
H  6.894004 0.720499 -1.873061
H  6.852468 -1.068361 -1.601175
H  8.241648 -0.092229 -0.990439
