program: Gaussian 09
title: 000295306
version: EM64L-G09RevD.01
frameworkgroup: C1[X(C16H16ClNO)]
method: RPBEPBE
basis: SDD
operation: Freq
keyword: #p
keyword: freq=noraman
keyword: PBEPBE/SDD
title: #p freq=noraman PBEPBE/SDD
converged: YES YES NO NO
title: Mulliken charges:
elementType: Cl O N C C C C C C C C C C C C C C C C H H H H H H H H H H H H H H H H
charge: -0.054702 -0.243777 -0.266924 -0.041525 0.433924 -0.684591 -0.694722 0.068135 0.428783 -0.340461 -0.345339 -0.313753 -0.327658 -0.224070 -0.227236 -0.237979 -0.238976 -0.233758 -0.222420 0.261151 0.218636 0.222081 0.231761 0.222638 0.221994 0.225768 0.257559 0.250638 0.235836 0.232428 0.229898 0.231600 0.256841 0.233608 0.234615
chargesum: 0.00000
title: Mulliken charges with hydrogens summed into heavy atoms:
elementType: Cl O N C C C C C C C C C C C C C C C C
charge: -0.054702 -0.243777 -0.266924 0.219626 0.433924 -0.012114 -0.024321 0.068135 0.428783 -0.082902 -0.094702 -0.313753 -0.091822 0.008358 0.002662 -0.006379 0.017864 -0.000151 0.012195
polarizability: 1.85945117e+02 -8.00355384e+00 1.90128326e+02 -1.09483847e+01 -1.03368333e+01 1.69730159e+02
1716.lowfreq: -14.0581 -12.6345 -4.4919 0.0015 0.0015 0.0016 6.4912 29.3418 31.9374
frequency: -8.7877 29.1999 31.6035 49.9149 53.0744 95.8386 116.7718 145.7094 155.3043 195.7317 230.4853 235.2745 263.6034 265.6187 298.7907 315.6882 347.9231 377.9633 398.7263 413.5108 428.8516 455.7151 462.0037 517.0804 542.4930 589.2581 615.8078 632.2304 672.2163 691.3693 705.4528 709.3477 737.4596 764.0400 767.2283 822.6313 852.0034 868.9894 907.4511 922.5947 924.1520 940.8699 946.1284 958.2359 979.1258 985.6734 990.7647 997.3736 1018.4679 1026.0101 1034.5848 1078.2346 1119.3486 1121.8907 1140.9064 1144.1660 1172.3597 1173.1170 1182.6538 1187.5256 1241.8187 1259.3137 1306.6419 1318.5035 1339.0429 1366.7141 1373.5999 1374.0906 1387.9734 1393.1614 1418.4146 1436.6811 1459.3153 1464.4764 1468.5021 1477.1655 1483.8727 1488.4086 1563.2815 1573.4880 1589.7456 1602.6353 1608.5554 2980.9109 2984.8849 3029.3625 3076.4516 3084.9294 3086.0087 3091.4149 3128.0754 3134.2711 3135.8997 3145.5720 3148.7981 3157.8539 3161.6404 3169.4190 3175.6479
redmass: 2.9005 6.7918 5.8051 4.7770 4.5589 4.2392 4.2143 7.1842 5.1250 4.2639 1.1037 4.8165 1.1025 3.0095 3.2243 4.2470 7.9548 4.7301 6.1354 2.8860 4.0589 3.6777 2.9389 5.2387 3.6446 3.2587 6.4396 6.4706 6.6062 5.4301 1.9284 7.0046 2.9804 1.5230 1.8337 3.8198 1.2446 1.4151 2.9376 1.2781 1.3988 1.3748 1.4884 2.5556 1.3778 1.3319 5.9659 1.3301 6.8398 2.0277 2.3622 1.5611 1.9164 1.8355 2.4999 2.4011 1.0547 1.0592 1.1428 2.1275 3.0781 1.4900 1.6977 2.1874 1.3423 7.9880 5.6766 1.2874 1.6138 1.2359 2.2067 2.2223 2.6038 1.0468 1.0648 1.1779 1.8531 1.0622 9.1639 7.1032 6.3648 7.2025 6.2494 1.0349 1.0358 1.0853 1.0996 1.0994 1.1000 1.1001 1.0849 1.0859 1.0885 1.0906 1.0933 1.0963 1.0954 1.1013 1.0997
irintensity: 0.0393 0.1129 2.3061 0.7137 0.3411 0.7286 0.0883 1.3557 0.4005 2.1939 0.0348 1.1731 0.1208 1.6963 0.2178 1.6579 6.1883 1.7892 8.7957 0.1261 3.2067 7.7399 6.5716 6.6646 6.5910 17.3687 0.4061 18.0176 17.2540 5.7371 57.2351 9.1341 19.9762 77.7352 32.5810 1.9909 0.3507 0.8041 8.4317 2.5210 1.3442 0.0510 3.4225 1.2221 0.2951 0.0364 1.1344 0.2821 39.0052 7.8957 6.7358 11.9367 70.1531 25.8632 15.6131 10.0930 0.3002 0.3283 5.0399 27.5734 51.8861 4.8255 74.3172 175.5515 2.4597 4.4311 0.5020 25.2123 44.2572 4.6314 22.1739 6.1844 24.1354 5.8525 6.4207 43.6881 23.9809 24.9788 211.4965 96.7847 6.2366 6.8793 1.0008 22.2748 22.1385 8.7614 3.6081 54.4117 38.9210 27.5692 0.5920 0.9579 5.3175 9.1844 17.2860 19.9771 14.5573 12.5370 13.0971
temp: 298.150 k
press: 1.00000 atm
elementType: 17 8 7 6 6 6 6 6 6 6 6 6 6 6 6 6 6 6 6 1 1 1 1 1 1 1 1 1 1 1 1 1 1 1 1
symmnumber: 1
zpe: 726690.0 jmol-1
zpe.correction: 0.276782 hartree
zpe.thermalcorrener: 0.293894 hartree
zpe.thermalcorrenthalpy: 0.294839 hartree
zpe.thermalcorrgfe: 0.230670 hartree
zpe.sumelectzpe: -1207.981728 hartree
zpe.sumelectthermal: -1207.964616 hartree
zpe.sumelectthermalent: -1207.963672 hartree
zpe.sumelectthermalfe: -1208.027840 hartree
dipole: 1.7229 4.6846 -0.2076
dipole: 4.9957
quadrupole: -107.8775 -121.7587 -112.3950
quadrupole: -8.2912 -2.0141 -4.3991
quadrupole: 6.1329 -7.7483 1.6154 -8.2912 -2.0141 -4.3991
hfenergy: -1208.2585101 hartree
pointgroup: C01 [X(C16H16Cl1N1O1)]
dipole: -0.4066575 1.8353903 0.5735945 debye
polarizability: 185.0734467|12.2751689|182.5339506|-9.1458512|12.6664536|178.1962049 unknown
InChI: InChI=1S/C16H16ClNO/c1-12(2)18(13-8-4-3-5-9-13)16(19)14-10-6-7-11-15(14)17/h3-12H,1-2H3
charge 0 multiplicity 1
35 atoms
Cl 1.644749 -1.379281 -2.568731
O  0.101894 -2.842417 0.134694
N  -1.135251 -0.853833 0.213947
C  -2.424715 -1.631455 0.211953
C  -1.17508 0.589669 0.077407
C  -3.226532 -1.36515 -1.080458
C  -3.267321 -1.374764 1.479518
C  0.061489 -1.573769 0.147255
C  1.348171 -0.772008 0.157925
C  -0.897723 1.189386 -1.176241
C  -1.507783 1.404954 1.187174
C  2.195797 -0.688048 -0.967544
C  1.804351 -0.19155 1.369351
C  -0.946056 2.593721 -1.314528
C  -1.566731 2.808535 1.041316
C  -1.284984 3.407274 -0.208598
C  3.452298 -0.056254 -0.920542
C  3.063133 0.441003 1.444957
C  3.889102 0.507932 0.299662
H  -2.088851 -2.684276 0.215122
H  -4.123647 -2.010063 -1.099081
H  -3.560624 -0.313557 -1.142204
H  -2.620767 -1.594588 -1.974605
H  -2.673212 -1.548581 2.394335
H  -4.125447 -2.071301 1.493192
H  -3.669832 -0.34615 1.503124
H  -0.641637 0.5527 -2.030158
H  -1.698539 0.940602 2.159816
H  1.164494 -0.251102 2.256581
H  -0.722156 3.050221 -2.284911
H  -1.82107 3.433373 1.904681
H  -1.325201 4.496532 -0.318441
H  4.074426 -0.006496 -1.818728
H  3.397617 0.877463 2.391675
H  4.868143 0.996179 0.347887
